Difference: ClusterEMI2 (4 vs. 5)

Revision 52012-05-04 - MassimoSgaravatto

Line: 1 to 1
 
META TOPICPARENT name="CreamTesting"

Testing Report for gLite-CLUSTER 2.0.0 for EMI-2 (Savannah task #23327)

Line: 1588 to 1588
 
$ ./trunk/bin/glue-validator -h emi-demo15.cnaf.infn.it -p 2170 -b "o=grid" -t glue1
Added:
>
>
test_data_types (validator.EntryTest.EntryTest) Validating data types. ... ok test_mandatory_attributes (validator.EntryTest.EntryTest) Verifying the existence of mandatory attributes. ... ok test_object_class (validator.EntryTest.EntryTest) Verifying the object class ... ok test_single_valued (validator.EntryTest.EntryTest) Verifying single-valued attributes only have one value. ... ok test_data_types (validator.EntryTest.EntryTest) Validating data types. ... ok test_mandatory_attributes (validator.EntryTest.EntryTest) Verifying the existence of mandatory attributes. ... ok test_object_class (validator.EntryTest.EntryTest) Verifying the object class ... ok test_single_valued (validator.EntryTest.EntryTest) Verifying single-valued attributes only have one value. ... ok test_data_types (validator.EntryTest.EntryTest) Validating data types. ... ok test_mandatory_attributes (validator.EntryTest.EntryTest) Verifying the existence of mandatory attributes. ... ok test_object_class (validator.EntryTest.EntryTest) Verifying the object class ... ok test_single_valued (validator.EntryTest.EntryTest) Verifying single-valued attributes only have one value. ... ok test_data_types (validator.EntryTest.EntryTest) Validating data types. ... ok test_mandatory_attributes (validator.EntryTest.EntryTest) Verifying the existence of mandatory attributes. ... ok test_object_class (validator.EntryTest.EntryTest) Verifying the object class ... ok test_single_valued (validator.EntryTest.EntryTest) Verifying single-valued attributes only have one value. ... ok test_data_types (validator.EntryTest.EntryTest) Validating data types. ... ok test_mandatory_attributes (validator.EntryTest.EntryTest) Verifying the existence of mandatory attributes. ... ok test_object_class (validator.EntryTest.EntryTest) Verifying the object class ... ok test_single_valued (validator.EntryTest.EntryTest) Verifying single-valued attributes only have one value. ... ok test_data_types (validator.EntryTest.EntryTest) Validating data types. ... ok test_mandatory_attributes (validator.EntryTest.EntryTest) Verifying the existence of mandatory attributes. ... ok test_object_class (validator.EntryTest.EntryTest) Verifying the object class ... ok test_single_valued (validator.EntryTest.EntryTest) Verifying single-valued attributes only have one value. ... ok test_data_types (validator.EntryTest.EntryTest) Validating data types. ... ok test_mandatory_attributes (validator.EntryTest.EntryTest) Verifying the existence of mandatory attributes. ... ok test_object_class (validator.EntryTest.EntryTest) Verifying the object class ... ok test_single_valued (validator.EntryTest.EntryTest) Verifying single-valued attributes only have one value. ... ok test_data_types (validator.EntryTest.EntryTest) Validating data types. ... ok test_mandatory_attributes (validator.EntryTest.EntryTest) Verifying the existence of mandatory attributes. ... ok test_object_class (validator.EntryTest.EntryTest) Verifying the object class ... ok test_single_valued (validator.EntryTest.EntryTest) Verifying single-valued attributes only have one value. ... ok test_data_types (validator.EntryTest.EntryTest) Validating data types. ... ok test_mandatory_attributes (validator.EntryTest.EntryTest) Verifying the existence of mandatory attributes. ... ok test_object_class (validator.EntryTest.EntryTest) Verifying the object class ... ok test_single_valued (validator.EntryTest.EntryTest) Verifying single-valued attributes only have one value. ... ok test_data_types (validator.EntryTest.EntryTest) Validating data types. ... ok test_mandatory_attributes (validator.EntryTest.EntryTest) Verifying the existence of mandatory attributes. ... ok test_object_class (validator.EntryTest.EntryTest) Verifying the object class ... ok test_single_valued (validator.EntryTest.EntryTest) Verifying single-valued attributes only have one value. ... ok test_data_types (validator.EntryTest.EntryTest) Validating data types. ... ok test_mandatory_attributes (validator.EntryTest.EntryTest) Verifying the existence of mandatory attributes. ... ok test_object_class (validator.EntryTest.EntryTest) Verifying the object class ... ok test_single_valued (validator.EntryTest.EntryTest) Verifying single-valued attributes only have one value. ... ok test_data_types (validator.EntryTest.EntryTest) Validating data types. ... ok test_mandatory_attributes (validator.EntryTest.EntryTest) Verifying the existence of mandatory attributes. ... ok test_object_class (validator.EntryTest.EntryTest) Verifying the object class ... ok test_single_valued (validator.EntryTest.EntryTest) Verifying single-valued attributes only have one value. ... ok


Ran 48 tests in 0.009s

OK

 
Changed:
<
<
QUI
>
>
 

Glue2 compliance

Line: 1599 to 1700
 The reported problem is an issue of glue-validator (already reported to the developer)
Added:
>
>
For sl5:
 
$ ./trunk/bin/glue-validator -h emitestbed33.cnaf.infn.it -p 2170 -b "o=glue" -t glue2
test_data_types (validator.EntryTest.EntryTest)
Line: 1969 to 2072
 FAILED (failures=1)
Added:
>
>
For sl6:

$ ./trunk/bin/glue-validator -h emi-demo15.cnaf.infn.it -p 2170 -b "o=glue" -t glue2
test_data_types (validator.EntryTest.EntryTest)
Validating data types. ... ok
test_mandatory_attributes (validator.EntryTest.EntryTest)
Verifying the existence of mandatory attributes. ... ok
test_object_class (validator.EntryTest.EntryTest)
Verifying the object class ... ok
test_single_valued (validator.EntryTest.EntryTest)
Verifying single-valued attributes only have one value. ... ok
test_data_types (validator.EntryTest.EntryTest)
Validating data types. ... ok
test_mandatory_attributes (validator.EntryTest.EntryTest)
Verifying the existence of mandatory attributes. ... ok
test_object_class (validator.EntryTest.EntryTest)
Verifying the object class ... ok
test_single_valued (validator.EntryTest.EntryTest)
Verifying single-valued attributes only have one value. ... ok
test_data_types (validator.EntryTest.EntryTest)
Validating data types. ... ok
test_mandatory_attributes (validator.EntryTest.EntryTest)
Verifying the existence of mandatory attributes. ... ok
test_object_class (validator.EntryTest.EntryTest)
Verifying the object class ... ok
test_single_valued (validator.EntryTest.EntryTest)
Verifying single-valued attributes only have one value. ... ok
test_data_types (validator.EntryTest.EntryTest)
Validating data types. ... ok
test_mandatory_attributes (validator.EntryTest.EntryTest)
Verifying the existence of mandatory attributes. ... ok
test_object_class (validator.EntryTest.EntryTest)
Verifying the object class ... ok
test_single_valued (validator.EntryTest.EntryTest)
Verifying single-valued attributes only have one value. ... ok
test_data_types (validator.EntryTest.EntryTest)
Validating data types. ... ok
test_mandatory_attributes (validator.EntryTest.EntryTest)
Verifying the existence of mandatory attributes. ... ok
test_object_class (validator.EntryTest.EntryTest)
Verifying the object class ... ok
test_single_valued (validator.EntryTest.EntryTest)
Verifying single-valued attributes only have one value. ... ok
test_data_types (validator.EntryTest.EntryTest)
Validating data types. ... ok
test_mandatory_attributes (validator.EntryTest.EntryTest)
Verifying the existence of mandatory attributes. ... ok
test_object_class (validator.EntryTest.EntryTest)
Verifying the object class ... ok
test_single_valued (validator.EntryTest.EntryTest)
Verifying single-valued attributes only have one value. ... ok
test_data_types (validator.EntryTest.EntryTest)
Validating data types. ... ok
test_mandatory_attributes (validator.EntryTest.EntryTest)
Verifying the existence of mandatory attributes. ... ok
test_object_class (validator.EntryTest.EntryTest)
Verifying the object class ... ok
test_single_valued (validator.EntryTest.EntryTest)
Verifying single-valued attributes only have one value. ... ok
test_data_types (validator.EntryTest.EntryTest)
Validating data types. ... FAIL
test_mandatory_attributes (validator.EntryTest.EntryTest)
Verifying the existence of mandatory attributes. ... ok
test_object_class (validator.EntryTest.EntryTest)
Verifying the object class ... ok
test_single_valued (validator.EntryTest.EntryTest)
Verifying single-valued attributes only have one value. ... ok
test_data_types (validator.EntryTest.EntryTest)
Validating data types. ... ok
test_mandatory_attributes (validator.EntryTest.EntryTest)
Verifying the existence of mandatory attributes. ... ok
test_object_class (validator.EntryTest.EntryTest)
Verifying the object class ... ok
test_single_valued (validator.EntryTest.EntryTest)
Verifying single-valued attributes only have one value. ... ok
test_data_types (validator.EntryTest.EntryTest)
Validating data types. ... ok
test_mandatory_attributes (validator.EntryTest.EntryTest)
Verifying the existence of mandatory attributes. ... ok
test_object_class (validator.EntryTest.EntryTest)
Verifying the object class ... ok
test_single_valued (validator.EntryTest.EntryTest)
Verifying single-valued attributes only have one value. ... ok
test_data_types (validator.EntryTest.EntryTest)
Validating data types. ... ok
test_mandatory_attributes (validator.EntryTest.EntryTest)
Verifying the existence of mandatory attributes. ... ok
test_object_class (validator.EntryTest.EntryTest)
Verifying the object class ... ok
test_single_valued (validator.EntryTest.EntryTest)
Verifying single-valued attributes only have one value. ... ok
test_data_types (validator.EntryTest.EntryTest)
Validating data types. ... ok
test_mandatory_attributes (validator.EntryTest.EntryTest)
Verifying the existence of mandatory attributes. ... ok
test_object_class (validator.EntryTest.EntryTest)
Verifying the object class ... ok
test_single_valued (validator.EntryTest.EntryTest)
Verifying single-valued attributes only have one value. ... ok
test_data_types (validator.EntryTest.EntryTest)
Validating data types. ... ok
test_mandatory_attributes (validator.EntryTest.EntryTest)
Verifying the existence of mandatory attributes. ... ok
test_object_class (validator.EntryTest.EntryTest)
Verifying the object class ... ok
test_single_valued (validator.EntryTest.EntryTest)
Verifying single-valued attributes only have one value. ... ok
test_data_types (validator.EntryTest.EntryTest)
Validating data types. ... ok
test_mandatory_attributes (validator.EntryTest.EntryTest)
Verifying the existence of mandatory attributes. ... ok
test_object_class (validator.EntryTest.EntryTest)
Verifying the object class ... ok
test_single_valued (validator.EntryTest.EntryTest)
Verifying single-valued attributes only have one value. ... ok
test_data_types (validator.EntryTest.EntryTest)
Validating data types. ... ok
test_mandatory_attributes (validator.EntryTest.EntryTest)
Verifying the existence of mandatory attributes. ... ok
test_object_class (validator.EntryTest.EntryTest)
Verifying the object class ... ok
test_single_valued (validator.EntryTest.EntryTest)
Verifying single-valued attributes only have one value. ... ok
test_data_types (validator.EntryTest.EntryTest)
Validating data types. ... ok
test_mandatory_attributes (validator.EntryTest.EntryTest)
Verifying the existence of mandatory attributes. ... ok
test_object_class (validator.EntryTest.EntryTest)
Verifying the object class ... ok
test_single_valued (validator.EntryTest.EntryTest)
Verifying single-valued attributes only have one value. ... ok
test_data_types (validator.EntryTest.EntryTest)
Validating data types. ... ok
test_mandatory_attributes (validator.EntryTest.EntryTest)
Verifying the existence of mandatory attributes. ... ok
test_object_class (validator.EntryTest.EntryTest)
Verifying the object class ... ok
test_single_valued (validator.EntryTest.EntryTest)
Verifying single-valued attributes only have one value. ... ok
test_data_types (validator.EntryTest.EntryTest)
Validating data types. ... ok
test_mandatory_attributes (validator.EntryTest.EntryTest)
Verifying the existence of mandatory attributes. ... ok
test_object_class (validator.EntryTest.EntryTest)
Verifying the object class ... ok
test_single_valued (validator.EntryTest.EntryTest)
Verifying single-valued attributes only have one value. ... ok
test_data_types (validator.EntryTest.EntryTest)
Validating data types. ... ok
test_mandatory_attributes (validator.EntryTest.EntryTest)
Verifying the existence of mandatory attributes. ... ok
test_object_class (validator.EntryTest.EntryTest)
Verifying the object class ... ok
test_single_valued (validator.EntryTest.EntryTest)
Verifying single-valued attributes only have one value. ... ok
test_data_types (validator.EntryTest.EntryTest)
Validating data types. ... ok
test_mandatory_attributes (validator.EntryTest.EntryTest)
Verifying the existence of mandatory attributes. ... ok
test_object_class (validator.EntryTest.EntryTest)
Verifying the object class ... ok
test_single_valued (validator.EntryTest.EntryTest)
Verifying single-valued attributes only have one value. ... ok
test_data_types (validator.EntryTest.EntryTest)
Validating data types. ... ok
test_mandatory_attributes (validator.EntryTest.EntryTest)
Verifying the existence of mandatory attributes. ... ok
test_object_class (validator.EntryTest.EntryTest)
Verifying the object class ... ok
test_single_valued (validator.EntryTest.EntryTest)
Verifying single-valued attributes only have one value. ... ok
test_data_types (validator.EntryTest.EntryTest)
Validating data types. ... ok
test_mandatory_attributes (validator.EntryTest.EntryTest)
Verifying the existence of mandatory attributes. ... ok
test_object_class (validator.EntryTest.EntryTest)
Verifying the object class ... ok
test_single_valued (validator.EntryTest.EntryTest)
Verifying single-valued attributes only have one value. ... ok
test_data_types (validator.EntryTest.EntryTest)
Validating data types. ... ok
test_mandatory_attributes (validator.EntryTest.EntryTest)
Verifying the existence of mandatory attributes. ... ok
test_object_class (validator.EntryTest.EntryTest)
Verifying the object class ... ok
test_single_valued (validator.EntryTest.EntryTest)
Verifying single-valued attributes only have one value. ... ok
test_data_types (validator.EntryTest.EntryTest)
Validating data types. ... ok
test_mandatory_attributes (validator.EntryTest.EntryTest)
Verifying the existence of mandatory attributes. ... ok
test_object_class (validator.EntryTest.EntryTest)
Verifying the object class ... ok
test_single_valued (validator.EntryTest.EntryTest)
Verifying single-valued attributes only have one value. ... ok
test_data_types (validator.EntryTest.EntryTest)
Validating data types. ... ok
test_mandatory_attributes (validator.EntryTest.EntryTest)
Verifying the existence of mandatory attributes. ... ok
test_object_class (validator.EntryTest.EntryTest)
Verifying the object class ... ok
test_single_valued (validator.EntryTest.EntryTest)
Verifying single-valued attributes only have one value. ... ok
test_data_types (validator.EntryTest.EntryTest)
Validating data types. ... ok
test_mandatory_attributes (validator.EntryTest.EntryTest)
Verifying the existence of mandatory attributes. ... ok
test_object_class (validator.EntryTest.EntryTest)
Verifying the object class ... ok
test_single_valued (validator.EntryTest.EntryTest)
Verifying single-valued attributes only have one value. ... ok
test_data_types (validator.EntryTest.EntryTest)
Validating data types. ... ok
test_mandatory_attributes (validator.EntryTest.EntryTest)
Verifying the existence of mandatory attributes. ... ok
test_object_class (validator.EntryTest.EntryTest)
Verifying the object class ... ok
test_single_valued (validator.EntryTest.EntryTest)
Verifying single-valued attributes only have one value. ... ok
test_data_types (validator.EntryTest.EntryTest)
Validating data types. ... ok
test_mandatory_attributes (validator.EntryTest.EntryTest)
Verifying the existence of mandatory attributes. ... ok
test_object_class (validator.EntryTest.EntryTest)
Verifying the object class ... ok
test_single_valued (validator.EntryTest.EntryTest)
Verifying single-valued attributes only have one value. ... ok
test_data_types (validator.EntryTest.EntryTest)
Validating data types. ... ok
test_mandatory_attributes (validator.EntryTest.EntryTest)
Verifying the existence of mandatory attributes. ... ok
test_object_class (validator.EntryTest.EntryTest)
Verifying the object class ... ok
test_single_valued (validator.EntryTest.EntryTest)
Verifying single-valued attributes only have one value. ... ok
test_data_types (validator.EntryTest.EntryTest)
Validating data types. ... ok
test_mandatory_attributes (validator.EntryTest.EntryTest)
Verifying the existence of mandatory attributes. ... ok
test_object_class (validator.EntryTest.EntryTest)
Verifying the object class ... ok
test_single_valued (validator.EntryTest.EntryTest)
Verifying single-valued attributes only have one value. ... ok
test_data_types (validator.EntryTest.EntryTest)
Validating data types. ... ok
test_mandatory_attributes (validator.EntryTest.EntryTest)
Verifying the existence of mandatory attributes. ... ok
test_object_class (validator.EntryTest.EntryTest)
Verifying the object class ... ok
test_single_valued (validator.EntryTest.EntryTest)
Verifying single-valued attributes only have one value. ... ok
test_data_types (validator.EntryTest.EntryTest)
Validating data types. ... ok
test_mandatory_attributes (validator.EntryTest.EntryTest)
Verifying the existence of mandatory attributes. ... ok
test_object_class (validator.EntryTest.EntryTest)
Verifying the object class ... ok
test_single_valued (validator.EntryTest.EntryTest)
Verifying single-valued attributes only have one value. ... ok
test_data_types (validator.EntryTest.EntryTest)
Validating data types. ... ok
test_mandatory_attributes (validator.EntryTest.EntryTest)
Verifying the existence of mandatory attributes. ... ok
test_object_class (validator.EntryTest.EntryTest)
Verifying the object class ... ok
test_single_valued (validator.EntryTest.EntryTest)
Verifying single-valued attributes only have one value. ... ok
test_data_types (validator.EntryTest.EntryTest)
Validating data types. ... ok
test_mandatory_attributes (validator.EntryTest.EntryTest)
Verifying the existence of mandatory attributes. ... ok
test_object_class (validator.EntryTest.EntryTest)
Verifying the object class ... ok
test_single_valued (validator.EntryTest.EntryTest)
Verifying single-valued attributes only have one value. ... ok
test_data_types (validator.EntryTest.EntryTest)
Validating data types. ... ok
test_mandatory_attributes (validator.EntryTest.EntryTest)
Verifying the existence of mandatory attributes. ... ok
test_object_class (validator.EntryTest.EntryTest)
Verifying the object class ... ok
test_single_valued (validator.EntryTest.EntryTest)
Verifying single-valued attributes only have one value. ... ok
test_data_types (validator.EntryTest.EntryTest)
Validating data types. ... ok
test_mandatory_attributes (validator.EntryTest.EntryTest)
Verifying the existence of mandatory attributes. ... ok
test_object_class (validator.EntryTest.EntryTest)
Verifying the object class ... ok
test_single_valued (validator.EntryTest.EntryTest)
Verifying single-valued attributes only have one value. ... ok
test_data_types (validator.EntryTest.EntryTest)
Validating data types. ... ok
test_mandatory_attributes (validator.EntryTest.EntryTest)
Verifying the existence of mandatory attributes. ... ok
test_object_class (validator.EntryTest.EntryTest)
Verifying the object class ... ok
test_single_valued (validator.EntryTest.EntryTest)
Verifying single-valued attributes only have one value. ... ok
test_data_types (validator.EntryTest.EntryTest)
Validating data types. ... ok
test_mandatory_attributes (validator.EntryTest.EntryTest)
Verifying the existence of mandatory attributes. ... ok
test_object_class (validator.EntryTest.EntryTest)
Verifying the object class ... ok
test_single_valued (validator.EntryTest.EntryTest)
Verifying single-valued attributes only have one value. ... ok
test_data_types (validator.EntryTest.EntryTest)
Validating data types. ... ok
test_mandatory_attributes (validator.EntryTest.EntryTest)
Verifying the existence of mandatory attributes. ... ok
test_object_class (validator.EntryTest.EntryTest)
Verifying the object class ... ok
test_single_valued (validator.EntryTest.EntryTest)
Verifying single-valued attributes only have one value. ... ok
test_data_types (validator.EntryTest.EntryTest)
Validating data types. ... ok
test_mandatory_attributes (validator.EntryTest.EntryTest)
Verifying the existence of mandatory attributes. ... ok
test_object_class (validator.EntryTest.EntryTest)
Verifying the object class ... ok
test_single_valued (validator.EntryTest.EntryTest)
Verifying single-valued attributes only have one value. ... ok
test_data_types (validator.EntryTest.EntryTest)
Validating data types. ... ok
test_mandatory_attributes (validator.EntryTest.EntryTest)
Verifying the existence of mandatory attributes. ... ok
test_object_class (validator.EntryTest.EntryTest)
Verifying the object class ... ok
test_single_valued (validator.EntryTest.EntryTest)
Verifying single-valued attributes only have one value. ... ok
test_data_types (validator.EntryTest.EntryTest)
Validating data types. ... ok
test_mandatory_attributes (validator.EntryTest.EntryTest)
Verifying the existence of mandatory attributes. ... ok
test_object_class (validator.EntryTest.EntryTest)
Verifying the object class ... ok
test_single_valued (validator.EntryTest.EntryTest)
Verifying single-valued attributes only have one value. ... ok
test_data_types (validator.EntryTest.EntryTest)
Validating data types. ... ok
test_mandatory_attributes (validator.EntryTest.EntryTest)
Verifying the existence of mandatory attributes. ... ok
test_object_class (validator.EntryTest.EntryTest)
Verifying the object class ... ok
test_single_valued (validator.EntryTest.EntryTest)
Verifying single-valued attributes only have one value. ... ok
test_data_types (validator.EntryTest.EntryTest)
Validating data types. ... ok
test_mandatory_attributes (validator.EntryTest.EntryTest)
Verifying the existence of mandatory attributes. ... ok
test_object_class (validator.EntryTest.EntryTest)
Verifying the object class ... ok
test_single_valued (validator.EntryTest.EntryTest)
Verifying single-valued attributes only have one value. ... ok

======================================================================
FAIL: test_data_types (validator.EntryTest.EntryTest)
Validating data types.
----------------------------------------------------------------------
Traceback (most recent call last):
  File "/home/sgaravat/GlueValidator/trunk/lib/validator/EntryTest.py", line 60, in test_data_types
    self.assertTrue(check(value), message)
AssertionError: The field GLUE2EndpointCapability with value 'information.publication' does not follow the type Capability_t in GLUE2EndpointID=TestCluster_org.glite.ce.ApplicationPublisher_495524567,GLUE2ServiceID=TestCluster,GLUE2GroupID=resource,o=glue

----------------------------------------------------------------------
Ran 176 tests in 0.017s

FAILED (failures=1)
 -- MassimoSgaravatto - 2012-04-27

META FILEATTACHMENT attachment="yum-freshinst-sl5.log" attr="" comment="Yum log for fresh installation on sl5" date="1335642178" name="yum-freshinst-sl5.log" path="yum-freshinst-sl5.log" size="94351" user="MassimoSgaravatto" version="1"
 
This site is powered by the TWiki collaboration platformCopyright © 2008-2020 by the contributing authors. All material on this collaboration platform is the property of the contributing authors.
Ideas, requests, problems regarding TWiki? Send feedback