Difference: EMI1CREAMTask31335 (1 vs. 6)

Revision 62012-07-30 - SergioTraldi

Line: 1 to 1
 
META TOPICPARENT name="TestingCreamDgas"

Testing report: IGIRTC-90

Line: 419 to 419
  cream_concurrency_level="50"
Added:
>
>
Bug #81561 Make JobDBAdminPurger script compliant with CREAM EMI environment. FIXED

[root@cream-39 ~]# JobDBAdminPurger.sh -c /etc/glite-ce-cream/cream-config.xml -u root -p Omit -s DONE-FAILED,0
START jobAdminPurger
-----------------------------------------------------------
Job CREAM625377693 is going to be purged ...
- Job deleted. JobId = CREAM625377693
CREAM625377693 has been purged!
-----------------------------------------------------------

-----------------------------------------------------------
Job CREAM788041069 is going to be purged ...
- Job deleted. JobId = CREAM788041069
CREAM788041069 has been purged!
-----------------------------------------------------------

-----------------------------------------------------------
Job CREAM383108706 is going to be purged ...
- Job deleted. JobId = CREAM383108706
CREAM383108706 has been purged!
-----------------------------------------------------------

-----------------------------------------------------------
Job CREAM043174179 is going to be purged ...
- Job deleted. JobId = CREAM043174179
CREAM043174179 has been purged!
-----------------------------------------------------------

-----------------------------------------------------------
Job CREAM717118460 is going to be purged ...
- Job deleted. JobId = CREAM717118460
CREAM717118460 has been purged!
-----------------------------------------------------------

-----------------------------------------------------------
Job CREAM022818615 is going to be purged ...
- Job deleted. JobId = CREAM022818615
CREAM022818615 has been purged!
-----------------------------------------------------------

-----------------------------------------------------------
Job CREAM533553210 is going to be purged ...
- Job deleted. JobId = CREAM533553210
CREAM533553210 has been purged!
-----------------------------------------------------------

-----------------------------------------------------------
Job CREAM395181565 is going to be purged ...
- Job deleted. JobId = CREAM395181565
CREAM395181565 has been purged!
-----------------------------------------------------------

-----------------------------------------------------------
Job CREAM675775142 is going to be purged ...
- Job deleted. JobId = CREAM675775142
CREAM675775142 has been purged!
-----------------------------------------------------------

-----------------------------------------------------------
Job CREAM848763262 is going to be purged ...
- Job deleted. JobId = CREAM848763262
CREAM848763262 has been purged!
-----------------------------------------------------------

-----------------------------------------------------------
Job CREAM374717858 is going to be purged ...
- Job deleted. JobId = CREAM374717858
CREAM374717858 has been purged!
-----------------------------------------------------------

-----------------------------------------------------------
Job CREAM285840086 is going to be purged ...
- Job deleted. JobId = CREAM285840086
CREAM285840086 has been purged!
-----------------------------------------------------------

-----------------------------------------------------------
Job CREAM758929715 is going to be purged ...
- Job deleted. JobId = CREAM758929715
CREAM758929715 has been purged!
-----------------------------------------------------------

-----------------------------------------------------------
Job CREAM073243598 is going to be purged ...
- Job deleted. JobId = CREAM073243598
CREAM073243598 has been purged!
-----------------------------------------------------------

-----------------------------------------------------------
Job CREAM101671150 is going to be purged ...
- Job deleted. JobId = CREAM101671150
CREAM101671150 has been purged!
-----------------------------------------------------------

-----------------------------------------------------------
Job CREAM740543089 is going to be purged ...
- Job deleted. JobId = CREAM740543089
CREAM740543089 has been purged!
-----------------------------------------------------------

STOP jobAdminPurger

Bug #83749 JobDBAdminPurger cannot purge jobs if configured sandbox dir has changed. FIXED

From UI:

[traldi@cert-25 ~]$ glite-ce-job-submit -r cream-39.pd.infn.it:8443/cream-pbs-cert -a simple.jdl 
https://cream-39.pd.infn.it:8443/CREAM043275171

[traldi@cert-25 ~]$ glite-ce-job-submit -r cream-39.pd.infn.it:8443/cream-pbs-cert -a simple.jdl 
https://cream-39.pd.infn.it:8443/CREAM525833264

[traldi@cert-25 ~]$ glite-ce-job-submit -r cream-39.pd.infn.it:8443/cream-pbs-cert -a simple.jdl 
https://cream-39.pd.infn.it:8443/CREAM551978142


[traldi@cert-25 ~]$ glite-ce-job-status https://cream-39.pd.infn.it:8443/CREAM043275171

******  JobID=[https://cream-39.pd.infn.it:8443/CREAM043275171]
        Status        = [DONE-OK]
        ExitCode      = [0]


[traldi@cert-25 ~]$ glite-ce-job-status https://cream-39.pd.infn.it:8443/CREAM525833264

******  JobID=[https://cream-39.pd.infn.it:8443/CREAM525833264]
        Status        = [DONE-OK]
        ExitCode      = [0]


[traldi@cert-25 ~]$ glite-ce-job-status https://cream-39.pd.infn.it:8443/CREAM551978142

******  JobID=[https://cream-39.pd.infn.it:8443/CREAM551978142]
        Status        = [DONE-OK]
        ExitCode      = [0]

On CE Host:

[root@cream-39 ~]# grep SANDBOX siteinfo/site-info.def
CREAM_SANDBOX_PATH="/var/cream_sandbox2"

[root@cream-39 ~]# /opt/glite/yaim/bin/yaim -c -s /root/siteinfo/site-info.def -n creamCE -n TORQUE_server -n TORQUE_utils 2>&1 | tee /root/conf_EMI1-CE_Torque.`hostname -s`.`date +%Y%m%d-%H%M%S`.log

[root@cream-39 ~]# JobDBAdminPurger.sh -c /etc/glite-ce-cream/cream-config.xml  -j CREAM043275171:CREAM525833264:CREAM551978142 -u root -p Omit
START jobAdminPurger
-----------------------------------------------------------
Job CREAM043275171 is going to be purged ...
- Job deleted. JobId = CREAM043275171
CREAM043275171 has been purged!
-----------------------------------------------------------

-----------------------------------------------------------
Job CREAM525833264 is going to be purged ...
- Job deleted. JobId = CREAM525833264
CREAM525833264 has been purged!
-----------------------------------------------------------

-----------------------------------------------------------
Job CREAM551978142 is going to be purged ...
- Job deleted. JobId = CREAM551978142
CREAM551978142 has been purged!
-----------------------------------------------------------

STOP jobAdminPurger


[root@cream-39 ~]# grep -r CREAM043275171 /var/cream_sandbox/dteam/

[root@cream-39 ~]# grep -r CREAM525833264 /var/cream_sandbox/dteam/

[root@cream-39 ~]# grep -r CREAM551978142 /var/cream_sandbox/dteam/

From UI:

[traldi@cert-25 ~]$ glite-ce-job-status https://cream-39.pd.infn.it:8443/CREAM043275171  https://cream-39.pd.infn.it:8443/CREAM525833264 https://cream-39.pd.infn.it:8443/CREAM551978142

******  JobID=[https://cream-39.pd.infn.it:8443/CREAM043275171]
        For this job CREAM has returned a fault: MethodName=[jobStatus] Timestamp=[Mon 30 Jul 2012 14:16:31] ErrorCode=[2] Description=[job not found] FaultCause=[N/A]



******  JobID=[https://cream-39.pd.infn.it:8443/CREAM525833264]
        For this job CREAM has returned a fault: MethodName=[jobStatus] Timestamp=[Mon 30 Jul 2012 14:16:31] ErrorCode=[2] Description=[job not found] FaultCause=[N/A]



******  JobID=[https://cream-39.pd.infn.it:8443/CREAM551978142]
        For this job CREAM has returned a fault: MethodName=[jobStatus] Timestamp=[Mon 30 Jul 2012 14:16:31] ErrorCode=[2] Description=[job not found] FaultCause=[N/A]
 Torque PASSED

Verification attached bugs for CREAM LSF

Line: 633 to 835
 
Added:
>
>
Bug #81561 Make JobDBAdminPurger script compliant with CREAM EMI environment. FIXED

[root@cream-29 ~]# JobDBAdminPurger.sh -c /etc/glite-ce-cream/cream-config.xml -u root -p Omit -s DONE-FAILED,0
START jobAdminPurger
-----------------------------------------------------------
Job CREAM707537372 is going to be purged ...
- Job deleted. JobId = CREAM707537372
CREAM707537372 has been purged!
-----------------------------------------------------------

-----------------------------------------------------------
Job CREAM871257393 is going to be purged ...
- Job deleted. JobId = CREAM871257393
CREAM871257393 has been purged!
-----------------------------------------------------------

-----------------------------------------------------------
Job CREAM321238641 is going to be purged ...
- Job deleted. JobId = CREAM321238641
CREAM321238641 has been purged!
-----------------------------------------------------------

-----------------------------------------------------------
Job CREAM604206884 is going to be purged ...
- Job deleted. JobId = CREAM604206884
CREAM604206884 has been purged!
-----------------------------------------------------------

-----------------------------------------------------------
Job CREAM356156585 is going to be purged ...
- Job deleted. JobId = CREAM356156585
CREAM356156585 has been purged!
-----------------------------------------------------------

-----------------------------------------------------------
Job CREAM977617424 is going to be purged ...
- Job deleted. JobId = CREAM977617424
CREAM977617424 has been purged!
-----------------------------------------------------------

-----------------------------------------------------------
Job CREAM752881329 is going to be purged ...
- Job deleted. JobId = CREAM752881329
CREAM752881329 has been purged!
-----------------------------------------------------------

-----------------------------------------------------------
Job CREAM503565085 is going to be purged ...
- Job deleted. JobId = CREAM503565085
CREAM503565085 has been purged!
-----------------------------------------------------------

STOP jobAdminPurger
 

Standard Conformance Tests

Glue 1 Compliance

Line: 1021 to 1281
 
META FILEATTACHMENT attachment="cream_1_13_4_upgrade_lsf.txt" attr="" comment="upgradelog CREAM LSF" date="1343577752" name="cream_1_13_4_upgrade_lsf.txt" path="cream_1_13_4_upgrade_lsf.txt" size="16063" user="CristinaAiftimiei" version="1"
META FILEATTACHMENT attachment="EMI_CREAM_1_13_4_test_report.txt" attr="" comment="" date="1343583657" name="EMI_CREAM_1_13_4_test_report.txt" path="EMI_CREAM_1_13_4_test_report.txt" size="2078" user="CristinaAiftimiei" version="1"
META FILEATTACHMENT attachment="EMI_CREAM_1_13_4_cert_report.txt" attr="" comment="" date="1343583657" name="EMI_CREAM_1_13_4_cert_report.txt" path="EMI_CREAM_1_13_4_cert_report.txt" size="2711" user="CristinaAiftimiei" version="1"
Added:
>
>
META FILEATTACHMENT attachment="clean_conf_log_pbs.txt" attr="h" comment="" date="1343654353" name="clean_conf_log_pbs.txt" path="clean_conf_log_pbs.txt" size="14018" user="SergioTraldi" version="1"
META FILEATTACHMENT attachment="clean_install_log_pbs.txt" attr="h" comment="" date="1343654353" name="clean_install_log_pbs.txt" path="clean_install_log_pbs.txt" size="149708" user="SergioTraldi" version="1"

Revision 52012-07-29 - CristinaAiftimiei

Line: 1 to 1
 
META TOPICPARENT name="TestingCreamDgas"

Testing report: IGIRTC-90

Line: 800 to 800
 OK
Changed:
<
<

Glue 1 Compliance

>
>

Glue 2 Compliance

  Result: PASSED The reported problem is "as expected" - the "testing" value is choosed for the internal testbed.

Revision 42012-07-29 - CristinaAiftimiei

Line: 1 to 1
 
META TOPICPARENT name="TestingCreamDgas"

Testing report: IGIRTC-90

Line: 13 to 13
 
  • EMI Major Release: EMI 1 (Kebnekaise)
  • Platform: SL5 epel
  • Author: Sergio Traldi
Changed:
<
<
>
>
 
  • Outcome: "Certified*
Added:
>
>
 

Deployment tests

Clean Installation

Line: 631 to 632
 cream_concurrency_level="50"
Changed:
<
<
LSF PASSED
>
>

Standard Conformance Tests

Glue 1 Compliance

Result: PASSED

[root@cream-29 ~]# glue-validator -t glue1 -h cream-29.pd.infn.it -p 2170 -b o=grid
Validating data types. ... ok
Verifying the existence of mandatory attributes. ... ok
Verifying the object class ... ok
Verifying single-valued attributes only have one value. ... ok
Validating data types. ... ok
Verifying the existence of mandatory attributes. ... ok
Verifying the object class ... ok
Verifying single-valued attributes only have one value. ... ok
Validating data types. ... ok
Verifying the existence of mandatory attributes. ... ok
Verifying the object class ... ok
Verifying single-valued attributes only have one value. ... ok
Validating data types. ... ok
Verifying the existence of mandatory attributes. ... ok
Verifying the object class ... ok
Verifying single-valued attributes only have one value. ... ok
Validating data types. ... ok
Verifying the existence of mandatory attributes. ... ok
Verifying the object class ... ok
Verifying single-valued attributes only have one value. ... ok
Validating data types. ... ok
Verifying the existence of mandatory attributes. ... ok
Verifying the object class ... ok
Verifying single-valued attributes only have one value. ... ok
Validating data types. ... ok
Verifying the existence of mandatory attributes. ... ok
Verifying the object class ... ok
Verifying single-valued attributes only have one value. ... ok
Validating data types. ... ok
Verifying the existence of mandatory attributes. ... ok
Verifying the object class ... ok
Verifying single-valued attributes only have one value. ... ok
Validating data types. ... ok
Verifying the existence of mandatory attributes. ... ok
Verifying the object class ... ok
Verifying single-valued attributes only have one value. ... ok
Validating data types. ... ok
Verifying the existence of mandatory attributes. ... ok
Verifying the object class ... ok
Verifying single-valued attributes only have one value. ... ok
Validating data types. ... ok
Verifying the existence of mandatory attributes. ... ok
Verifying the object class ... ok
Verifying single-valued attributes only have one value. ... ok
Validating data types. ... ok
Verifying the existence of mandatory attributes. ... ok
Verifying the object class ... ok
Verifying single-valued attributes only have one value. ... ok
Validating data types. ... ok
Verifying the existence of mandatory attributes. ... ok
Verifying the object class ... ok
Verifying single-valued attributes only have one value. ... ok
Validating data types. ... ok
Verifying the existence of mandatory attributes. ... ok
Verifying the object class ... ok
Verifying single-valued attributes only have one value. ... ok
Validating data types. ... ok
Verifying the existence of mandatory attributes. ... ok
Verifying the object class ... ok
Verifying single-valued attributes only have one value. ... ok
Validating data types. ... ok
Verifying the existence of mandatory attributes. ... ok
Verifying the object class ... ok
Verifying single-valued attributes only have one value. ... ok
Validating data types. ... ok
Verifying the existence of mandatory attributes. ... ok
Verifying the object class ... ok
Verifying single-valued attributes only have one value. ... ok
Validating data types. ... ok
Verifying the existence of mandatory attributes. ... ok
Verifying the object class ... ok
Verifying single-valued attributes only have one value. ... ok
Validating data types. ... ok
Verifying the existence of mandatory attributes. ... ok
Verifying the object class ... ok
Verifying single-valued attributes only have one value. ... ok
Validating data types. ... ok
Verifying the existence of mandatory attributes. ... ok
Verifying the object class ... ok
Verifying single-valued attributes only have one value. ... ok
Validating data types. ... ok
Verifying the existence of mandatory attributes. ... ok
Verifying the object class ... ok
Verifying single-valued attributes only have one value. ... ok
Validating data types. ... ok
Verifying the existence of mandatory attributes. ... ok
Verifying the object class ... ok
Verifying single-valued attributes only have one value. ... ok
Validating data types. ... ok
Verifying the existence of mandatory attributes. ... ok
Verifying the object class ... ok
Verifying single-valued attributes only have one value. ... ok
Validating data types. ... ok
Verifying the existence of mandatory attributes. ... ok
Verifying the object class ... ok
Verifying single-valued attributes only have one value. ... ok
Validating data types. ... ok
Verifying the existence of mandatory attributes. ... ok
Verifying the object class ... ok
Verifying single-valued attributes only have one value. ... ok
Validating data types. ... ok
Verifying the existence of mandatory attributes. ... ok
Verifying the object class ... ok
Verifying single-valued attributes only have one value. ... ok
Validating data types. ... ok
Verifying the existence of mandatory attributes. ... ok
Verifying the object class ... ok
Verifying single-valued attributes only have one value. ... ok
Validating data types. ... ok
Verifying the existence of mandatory attributes. ... ok
Verifying the object class ... ok
Verifying single-valued attributes only have one value. ... ok
Validating data types. ... ok
Verifying the existence of mandatory attributes. ... ok
Verifying the object class ... ok
Verifying single-valued attributes only have one value. ... ok
Validating data types. ... ok
Verifying the existence of mandatory attributes. ... ok
Verifying the object class ... ok
Verifying single-valued attributes only have one value. ... ok
Validating data types. ... ok
Verifying the existence of mandatory attributes. ... ok
Verifying the object class ... ok
Verifying single-valued attributes only have one value. ... ok
Validating data types. ... ok
Verifying the existence of mandatory attributes. ... ok
Verifying the object class ... ok
Verifying single-valued attributes only have one value. ... ok
Validating data types. ... ok
Verifying the existence of mandatory attributes. ... ok
Verifying the object class ... ok
Verifying single-valued attributes only have one value. ... ok
Validating data types. ... ok
Verifying the existence of mandatory attributes. ... ok
Verifying the object class ... ok
Verifying single-valued attributes only have one value. ... ok
Validating data types. ... ok
Verifying the existence of mandatory attributes. ... ok
Verifying the object class ... ok
Verifying single-valued attributes only have one value. ... ok
Validating data types. ... ok
Verifying the existence of mandatory attributes. ... ok
Verifying the object class ... ok
Verifying single-valued attributes only have one value. ... ok
Validating data types. ... ok
Verifying the existence of mandatory attributes. ... ok
Verifying the object class ... ok
Verifying single-valued attributes only have one value. ... ok
Validating data types. ... ok
Verifying the existence of mandatory attributes. ... ok
Verifying the object class ... ok
Verifying single-valued attributes only have one value. ... ok

----------------------------------------------------------------------
Ran 152 tests in 0.032s

OK

Glue 1 Compliance

Result: PASSED The reported problem is "as expected" - the "testing" value is choosed for the internal testbed.

[root@cream-29 ~]# glue-validator -t glue2 -h cream-29.pd.infn.it -p 2170 -b o=glue
Validating data types. ... ok
Verifying the existence of mandatory attributes. ... ok
Verifying the object class ... ok
Verifying single-valued attributes only have one value. ... ok
Validating data types. ... ok
Verifying the existence of mandatory attributes. ... ok
Verifying the object class ... ok
Verifying single-valued attributes only have one value. ... ok
Validating data types. ... ok
Verifying the existence of mandatory attributes. ... ok
Verifying the object class ... ok
Verifying single-valued attributes only have one value. ... ok
Validating data types. ... ok
Verifying the existence of mandatory attributes. ... ok
Verifying the object class ... ok
Verifying single-valued attributes only have one value. ... ok
Validating data types. ... ok
Verifying the existence of mandatory attributes. ... ok
Verifying the object class ... ok
Verifying single-valued attributes only have one value. ... ok
Validating data types. ... ok
Verifying the existence of mandatory attributes. ... ok
Verifying the object class ... ok
Verifying single-valued attributes only have one value. ... ok
Validating data types. ... ok
Verifying the existence of mandatory attributes. ... ok
Verifying the object class ... ok
Verifying single-valued attributes only have one value. ... ok
Validating data types. ... ok
Verifying the existence of mandatory attributes. ... ok
Verifying the object class ... ok
Verifying single-valued attributes only have one value. ... ok
Validating data types. ... ok
Verifying the existence of mandatory attributes. ... ok
Verifying the object class ... ok
Verifying single-valued attributes only have one value. ... ok
Validating data types. ... ok
Verifying the existence of mandatory attributes. ... ok
Verifying the object class ... ok
Verifying single-valued attributes only have one value. ... ok
Validating data types. ... ok
Verifying the existence of mandatory attributes. ... ok
Verifying the object class ... ok
Verifying single-valued attributes only have one value. ... ok
Validating data types. ... ok
Verifying the existence of mandatory attributes. ... ok
Verifying the object class ... ok
Verifying single-valued attributes only have one value. ... ok
Validating data types. ... ok
Verifying the existence of mandatory attributes. ... ok
Verifying the object class ... ok
Verifying single-valued attributes only have one value. ... ok
Validating data types. ... ok
Verifying the existence of mandatory attributes. ... ok
Verifying the object class ... ok
Verifying single-valued attributes only have one value. ... ok
Validating data types. ... ok
Verifying the existence of mandatory attributes. ... ok
Verifying the object class ... ok
Verifying single-valued attributes only have one value. ... ok
Validating data types. ... ok
Verifying the existence of mandatory attributes. ... ok
Verifying the object class ... ok
Verifying single-valued attributes only have one value. ... ok
Validating data types. ... ok
Verifying the existence of mandatory attributes. ... ok
Verifying the object class ... ok
Verifying single-valued attributes only have one value. ... ok
Validating data types. ... ok
Verifying the existence of mandatory attributes. ... ok
Verifying the object class ... ok
Verifying single-valued attributes only have one value. ... ok
Validating data types. ... ok
Verifying the existence of mandatory attributes. ... ok
Verifying the object class ... ok
Verifying single-valued attributes only have one value. ... ok
Validating data types. ... ok
Verifying the existence of mandatory attributes. ... ok
Verifying the object class ... ok
Verifying single-valued attributes only have one value. ... ok
Validating data types. ... ok
Verifying the existence of mandatory attributes. ... ok
Verifying the object class ... ok
Verifying single-valued attributes only have one value. ... ok
Validating data types. ... ok
Verifying the existence of mandatory attributes. ... ok
Verifying the object class ... ok
Verifying single-valued attributes only have one value. ... ok
Validating data types. ... ok
Verifying the existence of mandatory attributes. ... ok
Verifying the object class ... ok
Verifying single-valued attributes only have one value. ... ok
Validating data types. ... ok
Verifying the existence of mandatory attributes. ... ok
Verifying the object class ... ok
Verifying single-valued attributes only have one value. ... ok
Validating data types. ... ok
Verifying the existence of mandatory attributes. ... ok
Verifying the object class ... ok
Verifying single-valued attributes only have one value. ... ok
Validating data types. ... ok
Verifying the existence of mandatory attributes. ... ok
Verifying the object class ... ok
Verifying single-valued attributes only have one value. ... ok
Validating data types. ... ok
Verifying the existence of mandatory attributes. ... ok
Verifying the object class ... ok
Verifying single-valued attributes only have one value. ... ok
Validating data types. ... ok
Verifying the existence of mandatory attributes. ... ok
Verifying the object class ... ok
Verifying single-valued attributes only have one value. ... ok
Validating data types. ... ok
Verifying the existence of mandatory attributes. ... ok
Verifying the object class ... ok
Verifying single-valued attributes only have one value. ... ok
Validating data types. ... ok
Verifying the existence of mandatory attributes. ... ok
Verifying the object class ... ok
Verifying single-valued attributes only have one value. ... ok
Validating data types. ... ok
Verifying the existence of mandatory attributes. ... ok
Verifying the object class ... ok
Verifying single-valued attributes only have one value. ... ok
Validating data types. ... ok
Verifying the existence of mandatory attributes. ... ok
Verifying the object class ... ok
Verifying single-valued attributes only have one value. ... ok
Validating data types. ... ok
Verifying the existence of mandatory attributes. ... ok
Verifying the object class ... ok
Verifying single-valued attributes only have one value. ... ok
Validating data types. ... FAIL
Verifying the existence of mandatory attributes. ... ok
Verifying the object class ... ok
Verifying single-valued attributes only have one value. ... ok
Validating data types. ... ok
Verifying the existence of mandatory attributes. ... ok
Verifying the object class ... ok
Verifying single-valued attributes only have one value. ... ok
Validating data types. ... ok
Verifying the existence of mandatory attributes. ... ok
Verifying the object class ... ok
Verifying single-valued attributes only have one value. ... ok
Validating data types. ... ok
Verifying the existence of mandatory attributes. ... ok
Verifying the object class ... ok
Verifying single-valued attributes only have one value. ... ok
Validating data types. ... ok
Verifying the existence of mandatory attributes. ... ok
Verifying the object class ... ok
Verifying single-valued attributes only have one value. ... ok
Validating data types. ... ok
Verifying the existence of mandatory attributes. ... ok
Verifying the object class ... ok
Verifying single-valued attributes only have one value. ... ok
Validating data types. ... ok
Verifying the existence of mandatory attributes. ... ok
Verifying the object class ... ok
Verifying single-valued attributes only have one value. ... ok
Validating data types. ... ok
Verifying the existence of mandatory attributes. ... ok
Verifying the object class ... ok
Verifying single-valued attributes only have one value. ... ok
Validating data types. ... ok
Verifying the existence of mandatory attributes. ... ok
Verifying the object class ... ok
Verifying single-valued attributes only have one value. ... ok
Validating data types. ... ok
Verifying the existence of mandatory attributes. ... ok
Verifying the object class ... ok
Verifying single-valued attributes only have one value. ... ok

======================================================================
FAIL: Validating data types.
----------------------------------------------------------------------
Traceback (most recent call last):
  File "/usr/lib/python2.4/site-packages/validator/EntryTest.py", line 60, in test_data_types
    self.assertTrue(check(value), message)
AssertionError: The field GLUE2EndpointServingState with value 'testing' does not follow the type ServingState_t in GLUE2EndpointID=cream-29.pd.infn.it_ComputingElement_org.glite.ce.CREAM,GLUE2ServiceID=cream-29.pd.infn.it_ComputingElement,GLUE2GroupID=resource,o=glue

----------------------------------------------------------------------
Ran 172 tests in 0.054s

FAILED (failures=1)

Integration testing

Tests described:

  -- SergioTraldi - 2012-07-27
Line: 644 to 1019
 
META FILEATTACHMENT attachment="regressionPBS.tgz" attr="h" comment="" date="1343399483" name="regressionPBS.tgz" path="regressionPBS.tgz" size="117736" user="SergioTraldi" version="1"
META FILEATTACHMENT attachment="conf_EMI1_CREAM_1_13_4.cream-29.20120725-142849.log" attr="" comment="confiig log update CREAML SF" date="1343577492" name="conf_EMI1_CREAM_1_13_4.cream-29.20120725-142849.log" path="conf_EMI1_CREAM_1_13_4.cream-29.20120725-142849.log" size="44701" user="CristinaAiftimiei" version="1"
META FILEATTACHMENT attachment="cream_1_13_4_upgrade_lsf.txt" attr="" comment="upgradelog CREAM LSF" date="1343577752" name="cream_1_13_4_upgrade_lsf.txt" path="cream_1_13_4_upgrade_lsf.txt" size="16063" user="CristinaAiftimiei" version="1"
Added:
>
>
META FILEATTACHMENT attachment="EMI_CREAM_1_13_4_test_report.txt" attr="" comment="" date="1343583657" name="EMI_CREAM_1_13_4_test_report.txt" path="EMI_CREAM_1_13_4_test_report.txt" size="2078" user="CristinaAiftimiei" version="1"
META FILEATTACHMENT attachment="EMI_CREAM_1_13_4_cert_report.txt" attr="" comment="" date="1343583657" name="EMI_CREAM_1_13_4_cert_report.txt" path="EMI_CREAM_1_13_4_cert_report.txt" size="2711" user="CristinaAiftimiei" version="1"

Revision 32012-07-29 - CristinaAiftimiei

Line: 1 to 1
 
META TOPICPARENT name="TestingCreamDgas"

Testing report: IGIRTC-90

Line: 36 to 36
 

CREAM LSF

Changed:
<
<
>
>
 

Unit Tests

Line: 290 to 290
 
Changed:
<
<
Bug #81824(yaim-cream-ce should manage the attribute bupdater_loop_interval) FIXED
Bug #83238 Sometimes CREAM does not update the state of a failed job. FIXED
Bug # 84374 yaim-cream-ce: GlueForeignKey: GlueCEUniqueID: published using : instead of=. FIXED
Bug # 86191 No info published by the lcg-info-dynamic-scheduler for one VOView FIXED
Bug #87492 CREAM doesn't handle correctly the jdl attribute "environment". FIXED
>
>

Verification old bugs for CREAM Torque

Bug #81824(yaim-cream-ce should manage the attribute bupdater_loop_interval) FIXED
Bug #83238 Sometimes CREAM does not update the state of a failed job. FIXED
Bug # 84374 yaim-cream-ce: GlueForeignKey: GlueCEUniqueID: published using : instead of=. FIXED
Bug # 86191 No info published by the lcg-info-dynamic-scheduler for one VOView FIXED
Bug #87492 CREAM doesn't handle correctly the jdl attribute "environment". FIXED
 
[traldi@cert-25 cream_regression_testing]$ pybot tests
Line: 405 to 407
 
  • Complete testsuite log can be found here
Changed:
<
<
Bug #87361 The attribute cream_concurrency_level should be configurable via yaim FIXED
>
>
Bug #87361 The attribute cream_concurrency_level should be configurable via yaim FIXED
 
[root@cream-39 ~]# grep CREAM_CONCURRENCY_LEVEL /root/siteinfo/site-info.def 
Line: 500 to 502
 
Added:
>
>

Verification old bugs for CREAM LSF

 
Changed:
<
<
Bug #81824(yaim-cream-ce should manage the attribute bupdater_loop_interval) FIXED
Bug #83238 Sometimes CREAM does not update the state of a failed job. FIXED
Bug # 84374 yaim-cream-ce: GlueForeignKey: GlueCEUniqueID: published using : instead of=. FIXED
Bug # 86191 No info published by the lcg-info-dynamic-scheduler for one VOView FIXED
Bug #87492 CREAM doesn't handle correctly the jdl attribute "environment". FIXED
>
>
Bug #81824(yaim-cream-ce should manage the attribute bupdater_loop_interval) FIXED
Bug #83238 Sometimes CREAM does not update the state of a failed job. FIXED
Bug # 84374 yaim-cream-ce: GlueForeignKey: GlueCEUniqueID: published using : instead of=. FIXED
Bug # 86191 No info published by the lcg-info-dynamic-scheduler for one VOView FIXED
Bug #87492 CREAM doesn't handle correctly the jdl attribute "environment". FIXED
 
Line: 618 to 621
 
  • Complete testsuite log can be found here
Changed:
<
<
Bug #87361 The attribute cream_concurrency_level should be configurable via yaim FIXED
>
>
Bug #87361 The attribute cream_concurrency_level should be configurable via yaim FIXED
 
[root@cream-29 ~]# grep CREAM_CONCURRENCY_LEVEL /root/siteinfo/site-info.def
Line: 638 to 642
 
META FILEATTACHMENT attachment="regressionLSF.tgz" attr="h" comment="" date="1343399310" name="regressionLSF.tgz" path="regressionLSF.tgz" size="117804" user="SergioTraldi" version="1"
META FILEATTACHMENT attachment="functionalityPBS.tgz" attr="h" comment="" date="1343399310" name="functionalityPBS.tgz" path="functionalityPBS.tgz" size="349530" user="SergioTraldi" version="1"
META FILEATTACHMENT attachment="regressionPBS.tgz" attr="h" comment="" date="1343399483" name="regressionPBS.tgz" path="regressionPBS.tgz" size="117736" user="SergioTraldi" version="1"
Added:
>
>
META FILEATTACHMENT attachment="conf_EMI1_CREAM_1_13_4.cream-29.20120725-142849.log" attr="" comment="confiig log update CREAML SF" date="1343577492" name="conf_EMI1_CREAM_1_13_4.cream-29.20120725-142849.log" path="conf_EMI1_CREAM_1_13_4.cream-29.20120725-142849.log" size="44701" user="CristinaAiftimiei" version="1"
META FILEATTACHMENT attachment="cream_1_13_4_upgrade_lsf.txt" attr="" comment="upgradelog CREAM LSF" date="1343577752" name="cream_1_13_4_upgrade_lsf.txt" path="cream_1_13_4_upgrade_lsf.txt" size="16063" user="CristinaAiftimiei" version="1"

Revision 22012-07-27 - SergioTraldi

Line: 1 to 1
 
META TOPICPARENT name="TestingCreamDgas"

Testing report: IGIRTC-90

Line: 32 to 32
 

Upgrade Installation

CREAM PBS

Changed:
<
<
>
>
 

CREAM LSF

Changed:
<
<
>
>
 

Unit Tests

Line: 47 to 47
 

Functionality tests

Changed:
<
<

CREAM TORQUE

>
>

CREAM PBS

 
Changed:
<
<
>
>
 
[traldi@cert-25 ~]$ pybot  -e cpu_alloc3 -e glue -e ce_info -e auto_job_purge -e proxy_purge -e status -e job_man cream_test_suite.html
Line: 126 to 126
 
Changed:
<
<

CREAM TORQUE

>
>

CREAM LSF

 
Changed:
<
<
>
>
 
Changed:
<
<
[traldi@cert-25 ~]$ pybot -e cpu_alloc3 -e glue -e ce_info -e auto_job_purge -e proxy_purge -e status -e job_man cream_test_suite.html INFO: The files of this testsuite will be stored under: /tmp/tmppqRp7j.cream_testing/
>
>
[traldi@cert-25 ~]$ pybot -e glue -e ce_info -e auto_job_purge -e proxy_purge -e status -e job_man -e ban cream_test_suite.html INFO: The files of this testsuite will be stored under: /tmp/tmpWNOA0i.cream_testing/
 INFO: Non-mandatory variable "sec_proxy_pass" has not been set. ========================================================================== Cream Test Suite :: This is the main testing module,needed for testing the ...
Line: 177 to 177
 
Limiter :: NOTE: This test case is about 25 minutes long! | PASS |
Deleted:
<
<
Ban User :: This test case tests if the banning of user works. The... | PASS |
 Sandbox Staging :: This test case tests the two different Sandbox ... | PASS |
OutputData :: This test case tests the OutputData jdl attribute. T... | PASS |
Line: 189 to 187
 
CPU Allocation 2 :: Validate the contents of the batch job submiss... | PASS |
Added:
>
>
CPU Allocation 3 :: Validate the contents of the batch job submiss... | PASS |
 CPU Allocation 4 :: Validate the contents of the batch job submiss... | PASS |
CPU Allocation 5 :: Validate the contents of the batch job submiss... | PASS |
Line: 206 to 206
 

Regression tests

Changed:
<
<

Verification attached bugs

>
>

Verification attached bugs for CREAM Torque

Bug # 95480 CREAM doesn't transfert the output files remotely under well known conditions FIXED

On CE host:

[root@cream-39 ~]# grep LRMS /etc/glite-ce-cream/cream-config.xml
    <!-- The following parameter sets the sandbox transfer method (GSIFTP/LRMS)-->
    <parameter name="SANDBOX_TRANSFER_METHOD" value="LRMS" />
    <parameter name="LRMS_EVENT_LISTENER_PORT" value="9091" />

Form UI:

[traldi@cert-25 ~]$ glite-wms-job-submit -e https://wms-multi.grid.cnaf.infn.it:7443/glite_wms_wmproxy_server -r cream-39.pd.infn.it:8443/cream-pbs-cert -a outputTest.jdl 

Connecting to the service https://wms011.cnaf.infn.it:7443/glite_wms_wmproxy_server


====================== glite-wms-job-submit Success ======================

The job has been successfully submitted to the WMProxy
Your job identifier is:

https://wms011.cnaf.infn.it:9000/PQXcY69tgf3tpifjeWzjeQ

==========================================================================


[traldi@cert-25 ~]$ glite-wms-job-status https://wms011.cnaf.infn.it:9000/PQXcY69tgf3tpifjeWzjeQ
/usr/lib64/python
 
Changed:
<
<
Bug # 95480 CREAM doesn't transfert the output files remotely under well known conditions FIXED NOT CERTIFIED
>
>
=================== glite-wms-job-status Success ================= BOOKKEEPING INFORMATION:

Status info for the Job : https://wms011.cnaf.infn.it:9000/PQXcY69tgf3tpifjeWzjeQ Current Status: Scheduled Status Reason: unavailable Destination: cream-39.pd.infn.it:8443/cream-pbs-cert Submitted: Fri Jul 27 15:08:45 2012 CEST ======================================================================

[traldi@cert-25 ~]$ glite-wms-job-status https://wms011.cnaf.infn.it:9000/PQXcY69tgf3tpifjeWzjeQ /usr/lib64/python

=================== glite-wms-job-status Success ================= BOOKKEEPING INFORMATION:

Status info for the Job : https://wms011.cnaf.infn.it:9000/PQXcY69tgf3tpifjeWzjeQ Current Status: Done (Success) Exit code: 0 Status Reason: Job Terminated Successfully Destination: cream-39.pd.infn.it:8443/cream-pbs-cert Submitted: Fri Jul 27 15:08:45 2012 CEST ======================================================================

[traldi@cert-25 ~]$ glite-wms-job-output https://wms011.cnaf.infn.it:9000/PQXcY69tgf3tpifjeWzjeQ

Connecting to the service https://wms011.cnaf.infn.it:7443/glite_wms_wmproxy_server

============================================================================

JOB GET OUTPUT OUTCOME

Output sandbox files for the job: https://wms011.cnaf.infn.it:9000/PQXcY69tgf3tpifjeWzjeQ have been successfully retrieved and stored in the directory: /tmp/jobOutput/traldi_PQXcY69tgf3tpifjeWzjeQ

============================================================================

[traldi@cert-25 ~]$ cat /tmp/jobOutput/traldi_PQXcY69tgf3tpifjeWzjeQ/stdout Test bug 95480

 
Added:
>
>
Bug #81824(yaim-cream-ce should manage the attribute bupdater_loop_interval) FIXED
Bug #83238 Sometimes CREAM does not update the state of a failed job. FIXED
Bug # 84374 yaim-cream-ce: GlueForeignKey: GlueCEUniqueID: published using : instead of=. FIXED
Bug # 86191 No info published by the lcg-info-dynamic-scheduler for one VOView FIXED
Bug #87492 CREAM doesn't handle correctly the jdl attribute "environment". FIXED

[traldi@cert-25 cream_regression_testing]$ pybot tests
==============================================================================
Tests
==============================================================================
/home/traldi/cream_regression_testing/lib/conf/cream_testsuite_conf.py:21: DeprecationWarning: object.__new__() takes no parameters
  cls.__instance = object.__new__(cls, *args, **kargs)
 ce_host = cream-39.pd.infn.it
 dn = /C=IT/O=INFN/OU=Personal Certificate/L=Padova/CN=Sergio Traldi
 ce_endpoint = cream-39.pd.infn.it:8443
 cream_queue = cream-pbs-cert
 deleg_endpoint = https://cream-39.pd.infn.it:8443/ce-cream/services/gridsite-delegation
 vo = dteam
 proxy_pass = omit
 gridftp_server = cream-39.pd.infn.it
 lfn_dir = /home/traldi/cream_test
 gridftp_dir = /tmp
 deleg_id = sbe_deleg_id
 log_level = INFO
 batch_system = pbs
 torque_host = cream-39.pd.infn.it
 torque_admin_user = root
 tmp_dir = "/tmp"
 delete_files = True
 sec_cert = "/home/traldi/.globus/usercert.pem"
 sec_key = "/home/traldi/.globus/userkey.pem"
 sec_proxy_pass = "omit"
 ce_cream_xml = /etc/tomcat5/Catalina/localhost/ce-cream.xml
 cream_config_xml = /etc/glite-ce-cream/cream-config.xml
 blah_config = /etc/blah.config
 site_info = /root/siteinfo/site-info.def
 services_glite_creamce = /root/siteinfo/services/glite-creamce
 blah_cream_concurrency_level = cream_concurrency_level
 blah_bupdater_loop_interval = bupdater_loop_interval
 cream_sandbox_path = CREAM_SANDBOX_PATH
 ce = cream-39.pd.infn.it:8443/cream-pbs-cert
 ce_admin_user = root
 ce_admin_pass = omit
 creamdb_host = "cream-39.pd.infn.it"
 creamdb_port = "3360"
 creamdb_user = "glite"
 creamdb_pass = "omit"
 authz_model = "gjaf"
 argus_host = "cream-46.pd.infn.it"
 argus_root_pass = "omit"
The files of this testsuite will be stored under: /tmp/tmpyR3MOE.cream_testing/
Tests.Bug 81824 :: Regression test of bug #81824 yaim-cream-ce should manag...
==============================================================================
Set Log Level :: Set the log level used for the test suite. This c... | PASS |
------------------------------------------------------------------------------
bug_81824                                                             | PASS |
------------------------------------------------------------------------------
Tests.Bug 81824 :: Regression test of bug #81824 yaim-cream-ce sho... | PASS |
2 critical tests, 2 passed, 0 failed
2 tests total, 2 passed, 0 failed
==============================================================================
Tests.Bug 83238 :: Regression test of bug #83238 Sometimes CREAM does not u...
==============================================================================
Set Log Level :: Set the log level used for the test suite. This c... | PASS |
------------------------------------------------------------------------------
Check Executables :: Check whether the needed executables for the ... | PASS |
------------------------------------------------------------------------------
bug_83238                                                             | PASS |
------------------------------------------------------------------------------
Tests.Bug 83238 :: Regression test of bug #83238 Sometimes CREAM d... | PASS |
3 critical tests, 3 passed, 0 failed
3 tests total, 3 passed, 0 failed
==============================================================================
Tests.Bug 84374 :: Regression test of Bug #84374 yaim-cream-ce: GlueForeign...
==============================================================================
Set Log Level :: Set the log level used for the test suite. This c... | PASS |
------------------------------------------------------------------------------
bug_84374                                                             | PASS |
------------------------------------------------------------------------------
Tests.Bug 84374 :: Regression test of Bug #84374 yaim-cream-ce: Gl... | PASS |
2 critical tests, 2 passed, 0 failed
2 tests total, 2 passed, 0 failed
==============================================================================
Tests.Bug 86191 :: Regression test of Bug #86191 No info published by the l...
==============================================================================
Set Log Level :: Set the log level used for the test suite. This c... | PASS |
------------------------------------------------------------------------------
bug_84374                                                             | PASS |
------------------------------------------------------------------------------
Tests.Bug 86191 :: Regression test of Bug #86191 No info published... | PASS |
2 critical tests, 2 passed, 0 failed
2 tests total, 2 passed, 0 failed
==============================================================================
Tests.Bug 87492 :: Regression test of bug #87492 CREAM doesn't handle corre...
==============================================================================
Set Log Level :: Set the log level used for the test suite. This c... | PASS |
------------------------------------------------------------------------------
bug_87492                                                             | PASS |
------------------------------------------------------------------------------
Tests.Bug 87492 :: Regression test of bug #87492 CREAM doesn't han... | PASS |
2 critical tests, 2 passed, 0 failed
2 tests total, 2 passed, 0 failed
==============================================================================
Tests                                                                 | PASS |
11 critical tests, 11 passed, 0 failed
11 tests total, 11 passed, 0 failed
==============================================================================
Output:  /home/traldi/cream_regression_testing/output.xml
Log:     /home/traldi/cream_regression_testing/log.html
Report:  /home/traldi/cream_regression_testing/report.html

  • Complete testsuite log can be found here

Bug #87361 The attribute cream_concurrency_level should be configurable via yaim FIXED

[root@cream-39 ~]# grep CREAM_CONCURRENCY_LEVEL /root/siteinfo/site-info.def 
CREAM_CONCURRENCY_LEVEL=50


[root@cream-39 ~]# grep cream_concurrency_level /etc/glite-ce-cream/cream-config.xml
         cream_concurrency_level="50"
 
Added:
>
>
Torque PASSED

Verification attached bugs for CREAM LSF

Bug # 95480 CREAM doesn't transfert the output files remotely under well known conditions FIXED

On CE host:

[root@cream-29 ~]# grep LRMS /etc/glite-ce-cream/cream-config.xml
<!-- The following parameter sets the sandbox transfer method (GSIFTP/LRMS)-->
    <parameter name="SANDBOX_TRANSFER_METHOD" value=LRMS"" />
<parameter name="LRMS_EVENT_LISTENER_PORT" value="9091" />

Form UI:

[traldi@cert-25 ~]$ glite-wms-job-submit -e https://wms-multi.grid.cnaf.infn.it:7443/glite_wms_wmproxy_server -r cream-29.pd.infn.it:8443/cream-lsf-cert -a outputTest.jdl 

Connecting to the service https://gridrb.fe.infn.it:7443/glite_wms_wmproxy_server


====================== glite-wms-job-submit Success ======================

The job has been successfully submitted to the WMProxy
Your job identifier is:

https://gridrb.fe.infn.it:9000/9VdBnjYYEJdgJugK5d3uyA

==========================================================================


[traldi@cert-25 ~]$ glite-wms-job-status https://gridrb.fe.infn.it:9000/9VdBnjYYEJdgJugK5d3uyA
/usr/lib64/python


======================= glite-wms-job-status Success =====================
BOOKKEEPING INFORMATION:

Status info for the Job : https://gridrb.fe.infn.it:9000/9VdBnjYYEJdgJugK5d3uyA
Current Status:     Scheduled 
Status Reason:      unavailable
Destination:        cream-29.pd.infn.it:8443/cream-lsf-cert
Submitted:          Fri Jul 27 16:07:32 2012 CEST
==========================================================================


[traldi@cert-25 ~]$ glite-wms-job-status https://gridrb.fe.infn.it:9000/9VdBnjYYEJdgJugK5d3uyA
/usr/lib64/python


======================= glite-wms-job-status Success =====================
BOOKKEEPING INFORMATION:

Status info for the Job : https://gridrb.fe.infn.it:9000/9VdBnjYYEJdgJugK5d3uyA
Current Status:     Done (Success)
Exit code:          0
Status Reason:      Job Terminated Successfully
Destination:        cream-29.pd.infn.it:8443/cream-lsf-cert
Submitted:          Fri Jul 27 16:07:32 2012 CEST
==========================================================================

[traldi@cert-25 ~]$ glite-wms-job-output https://gridrb.fe.infn.it:9000/9VdBnjYYEJdgJugK5d3uyA

Connecting to the service https://gridrb.fe.infn.it:7443/glite_wms_wmproxy_server


================================================================================

                        JOB GET OUTPUT OUTCOME

Output sandbox files for the job:
https://gridrb.fe.infn.it:9000/9VdBnjYYEJdgJugK5d3uyA
have been successfully retrieved and stored in the directory:
/tmp/jobOutput/traldi_9VdBnjYYEJdgJugK5d3uyA

================================================================================


[traldi@cert-25 ~]$ cat /tmp/jobOutput/traldi_9VdBnjYYEJdgJugK5d3uyA/stdout 
Test bug 95480


Bug #81824(yaim-cream-ce should manage the attribute bupdater_loop_interval) FIXED
Bug #83238 Sometimes CREAM does not update the state of a failed job. FIXED
Bug # 84374 yaim-cream-ce: GlueForeignKey: GlueCEUniqueID: published using : instead of=. FIXED
Bug # 86191 No info published by the lcg-info-dynamic-scheduler for one VOView FIXED
Bug #87492 CREAM doesn't handle correctly the jdl attribute "environment". FIXED


[traldi@cert-25 cream_regression_testing]$ pybot tests
==============================================================================
Tests
==============================================================================
/home/traldi/cream_regression_testing/lib/conf/cream_testsuite_conf.py:21: DeprecationWarning: object.__new__() takes no parameters
  cls.__instance = object.__new__(cls, *args, **kargs)
 ce_host = cream-29.pd.infn.it
 dn = /C=IT/O=INFN/OU=Personal Certificate/L=Padova/CN=Sergio Traldi
 ce_endpoint = cream-29.pd.infn.it:8443
 cream_queue = cream-lsf-cert
 deleg_endpoint = https://cream-29.pd.infn.it:8443/ce-cream/services/gridsite-delegation
 vo = dteam
 proxy_pass = omit
 gridftp_server = cream-29.pd.infn.it
 lfn_dir = /home/traldi/cream_test
 gridftp_dir = /tmp
 deleg_id = sbe_deleg_id
 log_level = INFO
 batch_system = lsf
 torque_host = cream-29.pd.infn.it
 torque_admin_user = root
 tmp_dir = "/tmp"
 delete_files = True
 sec_cert = "/home/traldi/.globus/usercert.pem"
 sec_key = "/home/traldi/.globus/userkey.pem"
 sec_proxy_pass = "omit"
 ce_cream_xml = /etc/tomcat5/Catalina/localhost/ce-cream.xml
 cream_config_xml = /etc/glite-ce-cream/cream-config.xml
 blah_config = /etc/blah.config
 site_info = /root/siteinfo/site-info.def
 services_glite_creamce = /root/siteinfo/services/glite-creamce
 blah_cream_concurrency_level = cream_concurrency_level
 blah_bupdater_loop_interval = bupdater_loop_interval
 cream_sandbox_path = CREAM_SANDBOX_PATH
 ce = cream-29.pd.infn.it:8443/cream-lsf-cert
 ce_admin_user = root
 ce_admin_pass = omit
 creamdb_host = "cream-29.pd.infn.it"
 creamdb_port = "3360"
 creamdb_user = "glite"
 creamdb_pass = "pippo123"
 authz_model = "gjaf"
 argus_host = "cream-46.pd.infn.it"
 argus_root_pass = "omit"
The files of this testsuite will be stored under: /tmp/tmp5X43GH.cream_testing/
Tests.Bug 81824 :: Regression test of bug #81824 yaim-cream-ce should manag...
==============================================================================
Set Log Level :: Set the log level used for the test suite. This c... | PASS |
------------------------------------------------------------------------------
bug_81824                                                             | PASS |
------------------------------------------------------------------------------
Tests.Bug 81824 :: Regression test of bug #81824 yaim-cream-ce sho... | PASS |
2 critical tests, 2 passed, 0 failed
2 tests total, 2 passed, 0 failed
==============================================================================
Tests.Bug 83238 :: Regression test of bug #83238 Sometimes CREAM does not u...
==============================================================================
Set Log Level :: Set the log level used for the test suite. This c... | PASS |
------------------------------------------------------------------------------
Check Executables :: Check whether the needed executables for the ... | PASS |
------------------------------------------------------------------------------
bug_83238                                                             | PASS |
------------------------------------------------------------------------------
Tests.Bug 83238 :: Regression test of bug #83238 Sometimes CREAM d... | PASS |
3 critical tests, 3 passed, 0 failed
3 tests total, 3 passed, 0 failed
==============================================================================
Tests.Bug 84374 :: Regression test of Bug #84374 yaim-cream-ce: GlueForeign...
==============================================================================
Set Log Level :: Set the log level used for the test suite. This c... | PASS |
------------------------------------------------------------------------------
bug_84374                                                             | PASS |
------------------------------------------------------------------------------
Tests.Bug 84374 :: Regression test of Bug #84374 yaim-cream-ce: Gl... | PASS |
2 critical tests, 2 passed, 0 failed
2 tests total, 2 passed, 0 failed
==============================================================================
Tests.Bug 86191 :: Regression test of Bug #86191 No info published by the l...
==============================================================================
Set Log Level :: Set the log level used for the test suite. This c... | PASS |
------------------------------------------------------------------------------
bug_84374                                                             | PASS |
------------------------------------------------------------------------------
Tests.Bug 86191 :: Regression test of Bug #86191 No info published... | PASS |
2 critical tests, 2 passed, 0 failed
2 tests total, 2 passed, 0 failed
==============================================================================
Tests.Bug 87492 :: Regression test of bug #87492 CREAM doesn't handle corre...
==============================================================================
Set Log Level :: Set the log level used for the test suite. This c... | PASS |
------------------------------------------------------------------------------
bug_87492                                                             | PASS |
------------------------------------------------------------------------------
Tests.Bug 87492 :: Regression test of bug #87492 CREAM doesn't han... | PASS |
2 critical tests, 2 passed, 0 failed
2 tests total, 2 passed, 0 failed
==============================================================================
Tests                                                                 | PASS |
11 critical tests, 11 passed, 0 failed
11 tests total, 11 passed, 0 failed
==============================================================================
Output:  /home/traldi/cream_regression_testing/output.xml
Log:     /home/traldi/cream_regression_testing/log.html
Report:  /home/traldi/cream_regression_testing/report.html

  • Complete testsuite log can be found here

Bug #87361 The attribute cream_concurrency_level should be configurable via yaim FIXED

[root@cream-29 ~]# grep CREAM_CONCURRENCY_LEVEL /root/siteinfo/site-info.def
CREAM_CONCURRENCY_LEVEL=50

[root@cream-29 ~]# grep cream_concurrency_level /etc/glite-ce-cream/cream-config.xml
cream_concurrency_level="50"

LSF PASSED

  -- SergioTraldi - 2012-07-27 \ No newline at end of file
Added:
>
>
META FILEATTACHMENT attachment="Update-SL5-EMI1-CETorque.txt" attr="h" comment="" date="1343399310" name="Update-SL5-EMI1-CETorque.txt" path="Update-SL5-EMI1-CETorque.txt" size="157352" user="SergioTraldi" version="1"
META FILEATTACHMENT attachment="update_conf_log_pbs.txt" attr="h" comment="" date="1343399310" name="update_conf_log_pbs.txt" path="update_conf_log_pbs.txt" size="13986" user="SergioTraldi" version="1"
META FILEATTACHMENT attachment="functionalityLSF.tgz" attr="h" comment="" date="1343399310" name="functionalityLSF.tgz" path="functionalityLSF.tgz" size="339688" user="SergioTraldi" version="1"
META FILEATTACHMENT attachment="regressionLSF.tgz" attr="h" comment="" date="1343399310" name="regressionLSF.tgz" path="regressionLSF.tgz" size="117804" user="SergioTraldi" version="1"
META FILEATTACHMENT attachment="functionalityPBS.tgz" attr="h" comment="" date="1343399310" name="functionalityPBS.tgz" path="functionalityPBS.tgz" size="349530" user="SergioTraldi" version="1"
META FILEATTACHMENT attachment="regressionPBS.tgz" attr="h" comment="" date="1343399483" name="regressionPBS.tgz" path="regressionPBS.tgz" size="117736" user="SergioTraldi" version="1"

Revision 12012-07-27 - SergioTraldi

Line: 1 to 1
Added:
>
>
META TOPICPARENT name="TestingCreamDgas"

Testing report: IGIRTC-90

Summary

  • Product: CREAM v. 1.13.4
  • Release Task: Task #31335
  • ETICS Subsystem Configuration Name:
  • VCS Tag:
  • EMI Major Release: EMI 1 (Kebnekaise)
  • Platform: SL5 epel
  • Author: Sergio Traldi
  • Testing report: Testing Report file
  • Certification report: Certification Report file
  • Outcome: "Certified*

Deployment tests

Clean Installation

CREAM PBS

CREAM LSF

Upgrade Installation

CREAM PBS

CREAM LSF

Unit Tests

Not Available.

System tests

Functionality tests

CREAM TORQUE

[traldi@cert-25 ~]$ pybot  -e cpu_alloc3 -e glue -e ce_info -e auto_job_purge -e proxy_purge -e status -e job_man cream_test_suite.html
INFO: The files of this testsuite will be stored under: /tmp/tmppqRp7j.cream_testing/
INFO: Non-mandatory variable "sec_proxy_pass" has not been set.
==============================================================================
Cream Test Suite :: This is the main testing module,needed for testing the ...
==============================================================================
Set Log Level :: Set the log level used for the test suite. This c... | PASS |
------------------------------------------------------------------------------
Check Executables :: Check whether the needed executables for the ... | PASS |
------------------------------------------------------------------------------
Simple Submit :: Execute /bin/uname -a.Submit the jdl and wait for... | PASS |
------------------------------------------------------------------------------
ISB Base URI :: Execute a bash shell script.The script is stored i... | PASS |
------------------------------------------------------------------------------
ISB Client to CE :: Execute a bash shell script.The script is stor... | PASS |
------------------------------------------------------------------------------
ISB gsiftp to CE :: Execute a bash shell script.The script is stor... | PASS |
------------------------------------------------------------------------------
OSB localhost :: Execute /bin/uname -a.Store std out and error str... | PASS |
------------------------------------------------------------------------------
OSB gsiftp BaseDestURI :: Execute /bin/uname -a.Store std out and ... | PASS |
------------------------------------------------------------------------------
OSB gsiftp DestURI :: Execute /bin/uname -a.Store std out and erro... | PASS |
------------------------------------------------------------------------------
Environment :: Execute a bash shell script.The script is stored lo... | PASS |
------------------------------------------------------------------------------
Epilogue :: Execute two bash shell scripts,one for the job and the... | PASS |
------------------------------------------------------------------------------
Prologue :: Execute two bash shell scripts,one for the job and the... | PASS |
------------------------------------------------------------------------------
Explicit Delegation :: Test job submission with explicit delegatio... | PASS |
------------------------------------------------------------------------------
Job Cancel :: Test job cancellation.Two cases are tested:             | PASS |
------------------------------------------------------------------------------
Job List :: Test the job listing cli utility.Store the list of the... | PASS |
------------------------------------------------------------------------------
Job Suspend - Resume :: Submit a job and suspend it.Wait until it'... | PASS |
------------------------------------------------------------------------------
Manually Cancel Job :: Submit a job and then manually cancel it on... | PASS |
------------------------------------------------------------------------------
Enable - Disable Submission :: This test case tests the proper fun... | PASS |
------------------------------------------------------------------------------
Job Purge :: This test case verifies the proper functionality of t... | PASS |
------------------------------------------------------------------------------
Limiter :: NOTE: This test case is about 25 minutes long!             | PASS |
------------------------------------------------------------------------------
Ban User :: This test case tests if the banning of user works. The... | PASS |
------------------------------------------------------------------------------
Sandbox Staging :: This test case tests the two different Sandbox ... | PASS |
------------------------------------------------------------------------------
OutputData :: This test case tests the OutputData jdl attribute. T... | PASS |
------------------------------------------------------------------------------
Proxy Renewal :: Submit a job lasting 20 minutes using a proxy val... | PASS |
------------------------------------------------------------------------------
CPU Allocation 1 :: Validate the contents of the batch job submiss... | PASS |
------------------------------------------------------------------------------
CPU Allocation 2 :: Validate the contents of the batch job submiss... | PASS |
------------------------------------------------------------------------------
CPU Allocation 4 :: Validate the contents of the batch job submiss... | PASS |
------------------------------------------------------------------------------
CPU Allocation 5 :: Validate the contents of the batch job submiss... | PASS |
------------------------------------------------------------------------------
CPU Allocation 6 :: Validate the contents of the batch job submiss... | PASS |
------------------------------------------------------------------------------
Cream Test Suite :: This is the main testing module,needed for tes... | PASS |
29 critical tests, 29 passed, 0 failed
29 tests total, 29 passed, 0 failed
==============================================================================
Output:  /home/traldi/output.xml
Log:     /home/traldi/log.html
Report:  /home/traldi/report.html

CREAM TORQUE

[traldi@cert-25 ~]$ pybot  -e cpu_alloc3 -e glue -e ce_info -e auto_job_purge -e proxy_purge -e status -e job_man cream_test_suite.html
INFO: The files of this testsuite will be stored under: /tmp/tmppqRp7j.cream_testing/
INFO: Non-mandatory variable "sec_proxy_pass" has not been set.
==============================================================================
Cream Test Suite :: This is the main testing module,needed for testing the ...
==============================================================================
Set Log Level :: Set the log level used for the test suite. This c... | PASS |
------------------------------------------------------------------------------
Check Executables :: Check whether the needed executables for the ... | PASS |
------------------------------------------------------------------------------
Simple Submit :: Execute /bin/uname -a.Submit the jdl and wait for... | PASS |
------------------------------------------------------------------------------
ISB Base URI :: Execute a bash shell script.The script is stored i... | PASS |
------------------------------------------------------------------------------
ISB Client to CE :: Execute a bash shell script.The script is stor... | PASS |
------------------------------------------------------------------------------
ISB gsiftp to CE :: Execute a bash shell script.The script is stor... | PASS |
------------------------------------------------------------------------------
OSB localhost :: Execute /bin/uname -a.Store std out and error str... | PASS |
------------------------------------------------------------------------------
OSB gsiftp BaseDestURI :: Execute /bin/uname -a.Store std out and ... | PASS |
------------------------------------------------------------------------------
OSB gsiftp DestURI :: Execute /bin/uname -a.Store std out and erro... | PASS |
------------------------------------------------------------------------------
Environment :: Execute a bash shell script.The script is stored lo... | PASS |
------------------------------------------------------------------------------
Epilogue :: Execute two bash shell scripts,one for the job and the... | PASS |
------------------------------------------------------------------------------
Prologue :: Execute two bash shell scripts,one for the job and the... | PASS |
------------------------------------------------------------------------------
Explicit Delegation :: Test job submission with explicit delegatio... | PASS |
------------------------------------------------------------------------------
Job Cancel :: Test job cancellation.Two cases are tested:             | PASS |
------------------------------------------------------------------------------
Job List :: Test the job listing cli utility.Store the list of the... | PASS |
------------------------------------------------------------------------------
Job Suspend - Resume :: Submit a job and suspend it.Wait until it'... | PASS |
------------------------------------------------------------------------------
Manually Cancel Job :: Submit a job and then manually cancel it on... | PASS |
------------------------------------------------------------------------------
Enable - Disable Submission :: This test case tests the proper fun... | PASS |
------------------------------------------------------------------------------
Job Purge :: This test case verifies the proper functionality of t... | PASS |
------------------------------------------------------------------------------
Limiter :: NOTE: This test case is about 25 minutes long!             | PASS |
------------------------------------------------------------------------------
Ban User :: This test case tests if the banning of user works. The... | PASS |
------------------------------------------------------------------------------
Sandbox Staging :: This test case tests the two different Sandbox ... | PASS |
------------------------------------------------------------------------------
OutputData :: This test case tests the OutputData jdl attribute. T... | PASS |
------------------------------------------------------------------------------
Proxy Renewal :: Submit a job lasting 20 minutes using a proxy val... | PASS |
------------------------------------------------------------------------------
CPU Allocation 1 :: Validate the contents of the batch job submiss... | PASS |
------------------------------------------------------------------------------
CPU Allocation 2 :: Validate the contents of the batch job submiss... | PASS |
------------------------------------------------------------------------------
CPU Allocation 4 :: Validate the contents of the batch job submiss... | PASS |
------------------------------------------------------------------------------
CPU Allocation 5 :: Validate the contents of the batch job submiss... | PASS |
------------------------------------------------------------------------------
CPU Allocation 6 :: Validate the contents of the batch job submiss... | PASS |
------------------------------------------------------------------------------
Cream Test Suite :: This is the main testing module,needed for tes... | PASS |
29 critical tests, 29 passed, 0 failed
29 tests total, 29 passed, 0 failed
==============================================================================
Output:  /home/traldi/output.xml
Log:     /home/traldi/log.html
Report:  /home/traldi/report.html

Regression tests

Verification attached bugs

Bug # 95480 CREAM doesn't transfert the output files remotely under well known conditions FIXED NOT CERTIFIED

-- SergioTraldi - 2012-07-27

 
This site is powered by the TWiki collaboration platformCopyright © 2008-2019 by the contributing authors. All material on this collaboration platform is the property of the contributing authors.
Ideas, requests, problems regarding TWiki? Send feedback