Difference: EMI1CREAMTask40087 (1 vs. 7)

Revision 72013-03-17 - CristinaAiftimiei

Line: 1 to 1
 
META TOPICPARENT name="TestingCreamDgas"
Changed:
<
<

Testing report: IGIRTC-132

>
>

CREAM 1.13.5 & CEMon v. 1.13.4 test report - IGIRTC-132

 

Summary

Changed:
<
<
>
>
 
  • ETICS Subsystem Configuration Name: emi-cream-ce_R_1_13_11_1
  • VCS Tag:
  • EMI Major Release: EMI 1 (Kebnekaise)
Changed:
<
<
  • Platform: SL5 epel
>
>
  • Platform: SL5/x86_64
 
  • Machines: cream-23 LSF; cream-30 PBS
  • Author: Sara Bertocco
  • Testing report: [[][Testing Report file]]
  • Certification report: [[][Certification Report file]]
Changed:
<
<
  • Outcome: "In Certification*
>
>
  • Outcome: "Certifified*
 

Deployment tests

Revision 62013-03-08 - SaraBertocco

Line: 1 to 1
 
META TOPICPARENT name="TestingCreamDgas"

Testing report: IGIRTC-132

Revision 52013-02-28 - SaraBertocco

Line: 1 to 1
 
META TOPICPARENT name="TestingCreamDgas"

Testing report: IGIRTC-132

Line: 8 to 8
 
Changed:
<
<
  • ETICS Subsystem Configuration Name:
>
>
  • ETICS Subsystem Configuration Name: emi-cream-ce_R_1_13_11_1
 
  • VCS Tag:
  • EMI Major Release: EMI 1 (Kebnekaise)
  • Platform: SL5 epel
Added:
>
>
  • Machines: cream-23 LSF; cream-30 PBS
 
  • Author: Sara Bertocco
  • Testing report: [[][Testing Report file]]
  • Certification report: [[][Certification Report file]]
Line: 28 to 29
 

CREAM PBS PASSED

Changed:
<
<
>
>
 

Unit Tests

Added:
>
>
 

System tests

Functionality tests

Line: 35 to 37
 

Functionality tests

Changed:
<
<

CREAM PBS

>
>

CREAM PBS PASSED

$ /usr/bin/pybot  -i simple -i isb_baseuri -i isb_client -i isb_gsiftp -i osb_localhost -i osb_basedesturi -i osb_desturi -i env -i epilogue -i prologue -i deleg -i cancel -i list -i susp_res -i man_cancel -i en_dis_sub -i purge -i ban -i sb_stage /opt/cream_test/testsuite/cream_test_suite.html
INFO: The files of this testsuite will be stored under: /tmp/tmpKpp_Rn.cream_testing/
INFO: Non-mandatory variable "sec_cert" has not been set.
INFO: Non-mandatory variable "sec_key" has not been set.
INFO: Non-mandatory variable "sec_proxy_pass" has not been set.
INFO: Non-mandatory variable "argus_root_pass" has not been set.
==============================================================================
Cream Test Suite :: This is the main testing module,needed for testing the ...
==============================================================================
Simple Submit :: Execute /bin/uname -a.Submit the jdl and wait for... | PASS |
------------------------------------------------------------------------------
ISB Base URI :: Execute a bash shell script.The script is stored i... | PASS |
------------------------------------------------------------------------------
ISB Client to CE :: Execute a bash shell script.The script is stor... | PASS |
------------------------------------------------------------------------------
ISB gsiftp to CE :: Execute a bash shell script.The script is stor... | PASS |
------------------------------------------------------------------------------
OSB localhost :: Execute /bin/uname -a.Store std out and error str... | PASS |
------------------------------------------------------------------------------
OSB gsiftp BaseDestURI :: Execute /bin/uname -a.Store std out and ... | PASS |
------------------------------------------------------------------------------
OSB gsiftp DestURI :: Execute /bin/uname -a.Store std out and erro... | PASS |
------------------------------------------------------------------------------
Environment :: Execute a bash shell script.The script is stored lo... | PASS |
------------------------------------------------------------------------------
Epilogue :: Execute two bash shell scripts,one for the job and the... | PASS |
------------------------------------------------------------------------------
Prologue :: Execute two bash shell scripts,one for the job and the... | PASS |
------------------------------------------------------------------------------
Explicit Delegation :: Test job submission with explicit delegatio... | PASS |
------------------------------------------------------------------------------
Job Cancel :: Test job cancellation.Two cases are tested:             | PASS |
------------------------------------------------------------------------------
Job List :: Test the job listing cli utility.Store the list of the... | PASS |
------------------------------------------------------------------------------
Job Suspend - Resume :: Submit a job and suspend it.Wait until it'... | PASS |
------------------------------------------------------------------------------
Manually Cancel Job :: Submit a job and then manually cancel it on... | PASS |
------------------------------------------------------------------------------
Enable - Disable Submission :: This test case tests the proper fun... | PASS |
------------------------------------------------------------------------------
Job Purge :: This test case verifies the proper functionality of t... | PASS |
------------------------------------------------------------------------------
Ban User :: This test case tests if the banning of user works. The... | PASS |
------------------------------------------------------------------------------
Sandbox Staging :: This test case tests the two different Sandbox ... | PASS |
------------------------------------------------------------------------------
Cream Test Suite :: This is the main testing module,needed for tes... | PASS |
19 critical tests, 19 passed, 0 failed
19 tests total, 19 passed, 0 failed
==============================================================================
Output:  /home/bertocco/output.xml
Log:     /home/bertocco/log.html
Report:  /home/bertocco/report.html
 

CREAM LSF PASSED

Line: 94 to 153
 Report: /home/bertocco/report.html
Deleted:
<
<

Regression tests

Verification attached bugs for CREAM Torque

Bug # FIXED

Verification attached bugs for CREAM LSF

Bug #97441: CREAM: Unwanted auto-updating of the field "creationTime" on the creamdb database FIXED
 

Standard conformance tests

Changed:
<
<

Glue 1 Compliance

  • glue-validator -t glue1 -h cert-41.pd.infn.it -p 2170 -b o=grid 
    log
>
>

Glue 1 Compliance PASSED

glue-validator -t glue1 -h cert-41.pd.infn.it -p 2170 -b o=grid 
$ glue-validator -t glue1 -h cream-23.pd.infn.it -p 2170 -b o=grid 
Validating data types. ... ok
Verifying that attributes are not empty. ... ok
Verifying the existence of mandatory attributes. ... ok
Verifying the object class ... ok
Verifying single-valued attributes only have one value. ... ok
Validating data types. ... ok
Verifying that attributes are not empty. ... ok
Verifying the existence of mandatory attributes. ... ok
Verifying the object class ... ok
Verifying single-valued attributes only have one value. ... ok
Validating data types. ... ok
Verifying that attributes are not empty. ... ok
Verifying the existence of mandatory attributes. ... ok
Verifying the object class ... ok
Verifying single-valued attributes only have one value. ... ok
Validating data types. ... ok
Verifying that attributes are not empty. ... ok
Verifying the existence of mandatory attributes. ... ok
Verifying the object class ... ok
Verifying single-valued attributes only have one value. ... ok
Validating data types. ... ok
Verifying that attributes are not empty. ... ok
Verifying the existence of mandatory attributes. ... ok
Verifying the object class ... ok
Verifying single-valued attributes only have one value. ... ok
Validating data types. ... ok
Verifying that attributes are not empty. ... ok
Verifying the existence of mandatory attributes. ... ok
Verifying the object class ... ok
Verifying single-valued attributes only have one value. ... ok
Validating data types. ... ok
Verifying that attributes are not empty. ... ok
Verifying the existence of mandatory attributes. ... ok
Verifying the object class ... ok
Verifying single-valued attributes only have one value. ... ok
Validating data types. ... ok
Verifying that attributes are not empty. ... ok
Verifying the existence of mandatory attributes. ... ok
Verifying the object class ... ok
Verifying single-valued attributes only have one value. ... ok
Validating data types. ... ok
Verifying that attributes are not empty. ... ok
Verifying the existence of mandatory attributes. ... ok
Verifying the object class ... ok
Verifying single-valued attributes only have one value. ... ok
Validating data types. ... ok
Verifying that attributes are not empty. ... ok
Verifying the existence of mandatory attributes. ... ok
Verifying the object class ... ok
Verifying single-valued attributes only have one value. ... ok
Validating data types. ... ok
Verifying that attributes are not empty. ... ok
Verifying the existence of mandatory attributes. ... ok
Verifying the object class ... ok
Verifying single-valued attributes only have one value. ... ok
Validating data types. ... ok
Verifying that attributes are not empty. ... ok
Verifying the existence of mandatory attributes. ... ok
Verifying the object class ... ok
Verifying single-valued attributes only have one value. ... ok
Validating data types. ... ok
Verifying that attributes are not empty. ... ok
Verifying the existence of mandatory attributes. ... ok
Verifying the object class ... ok
Verifying single-valued attributes only have one value. ... ok
Validating data types. ... ok
Verifying that attributes are not empty. ... ok
Verifying the existence of mandatory attributes. ... ok
Verifying the object class ... ok
Verifying single-valued attributes only have one value. ... ok
Validating data types. ... ok
Verifying that attributes are not empty. ... ok
Verifying the existence of mandatory attributes. ... ok
Verifying the object class ... ok
Verifying single-valued attributes only have one value. ... ok
Validating data types. ... ok
Verifying that attributes are not empty. ... ok
Verifying the existence of mandatory attributes. ... ok
Verifying the object class ... ok
Verifying single-valued attributes only have one value. ... ok
Validating data types. ... ok
Verifying that attributes are not empty. ... ok
Verifying the existence of mandatory attributes. ... ok
Verifying the object class ... ok
Verifying single-valued attributes only have one value. ... ok
Validating data types. ... ok
Verifying that attributes are not empty. ... ok
Verifying the existence of mandatory attributes. ... ok
Verifying the object class ... ok
Verifying single-valued attributes only have one value. ... ok
Validating data types. ... ok
Verifying that attributes are not empty. ... ok
Verifying the existence of mandatory attributes. ... ok
Verifying the object class ... ok
Verifying single-valued attributes only have one value. ... ok
Validating data types. ... ok
Verifying that attributes are not empty. ... ok
Verifying the existence of mandatory attributes. ... ok
Verifying the object class ... ok
Verifying single-valued attributes only have one value. ... ok
Validating data types. ... ok
Verifying that attributes are not empty. ... ok
Verifying the existence of mandatory attributes. ... ok
Verifying the object class ... ok
Verifying single-valued attributes only have one value. ... ok
Validating data types. ... ok
Verifying that attributes are not empty. ... ok
Verifying the existence of mandatory attributes. ... ok
Verifying the object class ... ok
Verifying single-valued attributes only have one value. ... ok
Validating data types. ... ok
Verifying that attributes are not empty. ... ok
Verifying the existence of mandatory attributes. ... ok
Verifying the object class ... ok
Verifying single-valued attributes only have one value. ... ok
Validating data types. ... ok
Verifying that attributes are not empty. ... ok
Verifying the existence of mandatory attributes. ... ok
Verifying the object class ... ok
Verifying single-valued attributes only have one value. ... ok
Validating data types. ... ok
Verifying that attributes are not empty. ... ok
Verifying the existence of mandatory attributes. ... ok
Verifying the object class ... ok
Verifying single-valued attributes only have one value. ... ok
Validating data types. ... ok
Verifying that attributes are not empty. ... ok
Verifying the existence of mandatory attributes. ... ok
Verifying the object class ... ok
Verifying single-valued attributes only have one value. ... ok
Validating data types. ... ok
Verifying that attributes are not empty. ... ok
Verifying the existence of mandatory attributes. ... ok
Verifying the object class ... ok
Verifying single-valued attributes only have one value. ... ok
Validating data types. ... ok
Verifying that attributes are not empty. ... ok
Verifying the existence of mandatory attributes. ... ok
Verifying the object class ... ok
Verifying single-valued attributes only have one value. ... ok
Validating data types. ... ok
Verifying that attributes are not empty. ... ok
Verifying the existence of mandatory attributes. ... ok
Verifying the object class ... ok
Verifying single-valued attributes only have one value. ... ok
Validating data types. ... ok
Verifying that attributes are not empty. ... ok
Verifying the existence of mandatory attributes. ... ok
Verifying the object class ... ok
Verifying single-valued attributes only have one value. ... ok
Validating data types. ... ok
Verifying that attributes are not empty. ... ok
Verifying the existence of mandatory attributes. ... ok
Verifying the object class ... ok
Verifying single-valued attributes only have one value. ... ok
Validating data types. ... ok
Verifying that attributes are not empty. ... ok
Verifying the existence of mandatory attributes. ... ok
Verifying the object class ... ok
Verifying single-valued attributes only have one value. ... ok

----------------------------------------------------------------------
Ran 160 tests in 0.039s

OK

$ glue-validator -t glue1 -h cream-30.pd.infn.it -p 2170 -b o=grid 
Validating data types. ... ok
Verifying that attributes are not empty. ... ok
Verifying the existence of mandatory attributes. ... ok
Verifying the object class ... ok
Verifying single-valued attributes only have one value. ... ok
Validating data types. ... ok
Verifying that attributes are not empty. ... ok
Verifying the existence of mandatory attributes. ... ok
Verifying the object class ... ok
Verifying single-valued attributes only have one value. ... ok
Validating data types. ... ok
Verifying that attributes are not empty. ... ok
Verifying the existence of mandatory attributes. ... ok
Verifying the object class ... ok
Verifying single-valued attributes only have one value. ... ok
Validating data types. ... ok
Verifying that attributes are not empty. ... ok
Verifying the existence of mandatory attributes. ... ok
Verifying the object class ... ok
Verifying single-valued attributes only have one value. ... ok
Validating data types. ... ok
Verifying that attributes are not empty. ... ok
Verifying the existence of mandatory attributes. ... ok
Verifying the object class ... ok
Verifying single-valued attributes only have one value. ... ok
Validating data types. ... ok
Verifying that attributes are not empty. ... ok
Verifying the existence of mandatory attributes. ... ok
Verifying the object class ... ok
Verifying single-valued attributes only have one value. ... ok
Validating data types. ... ok
Verifying that attributes are not empty. ... ok
Verifying the existence of mandatory attributes. ... ok
Verifying the object class ... ok
Verifying single-valued attributes only have one value. ... ok
Validating data types. ... ok
Verifying that attributes are not empty. ... ok
Verifying the existence of mandatory attributes. ... ok
Verifying the object class ... ok
Verifying single-valued attributes only have one value. ... ok
Validating data types. ... ok
Verifying that attributes are not empty. ... ok
Verifying the existence of mandatory attributes. ... ok
Verifying the object class ... ok
Verifying single-valued attributes only have one value. ... ok
Validating data types. ... ok
Verifying that attributes are not empty. ... ok
Verifying the existence of mandatory attributes. ... ok
Verifying the object class ... ok
Verifying single-valued attributes only have one value. ... ok
Validating data types. ... ok
Verifying that attributes are not empty. ... ok
Verifying the existence of mandatory attributes. ... ok
Verifying the object class ... ok
Verifying single-valued attributes only have one value. ... ok
Validating data types. ... ok
Verifying that attributes are not empty. ... ok
Verifying the existence of mandatory attributes. ... ok
Verifying the object class ... ok
Verifying single-valued attributes only have one value. ... ok
Validating data types. ... ok
Verifying that attributes are not empty. ... ok
Verifying the existence of mandatory attributes. ... ok
Verifying the object class ... ok
Verifying single-valued attributes only have one value. ... ok
Validating data types. ... ok
Verifying that attributes are not empty. ... ok
Verifying the existence of mandatory attributes. ... ok
Verifying the object class ... ok
Verifying single-valued attributes only have one value. ... ok
Validating data types. ... ok
Verifying that attributes are not empty. ... ok
Verifying the existence of mandatory attributes. ... ok
Verifying the object class ... ok
Verifying single-valued attributes only have one value. ... ok
Validating data types. ... ok
Verifying that attributes are not empty. ... ok
Verifying the existence of mandatory attributes. ... ok
Verifying the object class ... ok
Verifying single-valued attributes only have one value. ... ok
Validating data types. ... ok
Verifying that attributes are not empty. ... ok
Verifying the existence of mandatory attributes. ... ok
Verifying the object class ... ok
Verifying single-valued attributes only have one value. ... ok
Validating data types. ... ok
Verifying that attributes are not empty. ... ok
Verifying the existence of mandatory attributes. ... ok
Verifying the object class ... ok
Verifying single-valued attributes only have one value. ... ok
Validating data types. ... ok
Verifying that attributes are not empty. ... ok
Verifying the existence of mandatory attributes. ... ok
Verifying the object class ... ok
Verifying single-valued attributes only have one value. ... ok
Validating data types. ... ok
Verifying that attributes are not empty. ... ok
Verifying the existence of mandatory attributes. ... ok
Verifying the object class ... ok
Verifying single-valued attributes only have one value. ... ok
Validating data types. ... ok
Verifying that attributes are not empty. ... ok
Verifying the existence of mandatory attributes. ... ok
Verifying the object class ... ok
Verifying single-valued attributes only have one value. ... ok
Validating data types. ... ok
Verifying that attributes are not empty. ... ok
Verifying the existence of mandatory attributes. ... ok
Verifying the object class ... ok
Verifying single-valued attributes only have one value. ... ok
Validating data types. ... ok
Verifying that attributes are not empty. ... ok
Verifying the existence of mandatory attributes. ... ok
Verifying the object class ... ok
Verifying single-valued attributes only have one value. ... ok
Validating data types. ... ok
Verifying that attributes are not empty. ... ok
Verifying the existence of mandatory attributes. ... ok
Verifying the object class ... ok
Verifying single-valued attributes only have one value. ... ok
Validating data types. ... ok
Verifying that attributes are not empty. ... ok
Verifying the existence of mandatory attributes. ... ok
Verifying the object class ... ok
Verifying single-valued attributes only have one value. ... ok
Validating data types. ... ok
Verifying that attributes are not empty. ... ok
Verifying the existence of mandatory attributes. ... ok
Verifying the object class ... ok
Verifying single-valued attributes only have one value. ... ok
Validating data types. ... ok
Verifying that attributes are not empty. ... ok
Verifying the existence of mandatory attributes. ... ok
Verifying the object class ... ok
Verifying single-valued attributes only have one value. ... ok
Validating data types. ... ok
Verifying that attributes are not empty. ... ok
Verifying the existence of mandatory attributes. ... ok
Verifying the object class ... ok
Verifying single-valued attributes only have one value. ... ok
Validating data types. ... ok
Verifying that attributes are not empty. ... ok
Verifying the existence of mandatory attributes. ... ok
Verifying the object class ... ok
Verifying single-valued attributes only have one value. ... ok
Validating data types. ... ok
Verifying that attributes are not empty. ... ok
Verifying the existence of mandatory attributes. ... ok
Verifying the object class ... ok
Verifying single-valued attributes only have one value. ... ok
 
Changed:
<
<

Glue 2 Compliance

>
>

Ran 150 tests in 0.025s
 
Changed:
<
<

Performance and scalability tests

>
>
OK
 
Changed:
<
<

Integration testing

>
>

Glue 2 Compliance PASSED

$ glue-validator -t glue2 -h cream-23.pd.infn.it -p 2170 -b o=glue
Validating data types. ... ok
Verifying that attributes are not empty. ... ok
Verifying the existence of mandatory attributes. ... ok
Verifying the object class ... ok
Verifying single-valued attributes only have one value. ... ok
Validating data types. ... ok
Verifying that attributes are not empty. ... ok
Verifying the existence of mandatory attributes. ... ok
Verifying the object class ... ok
Verifying single-valued attributes only have one value. ... ok
Validating data types. ... ok
Verifying that attributes are not empty. ... ok
Verifying the existence of mandatory attributes. ... ok
Verifying the object class ... ok
Verifying single-valued attributes only have one value. ... ok
Validating data types. ... ok
Verifying that attributes are not empty. ... ok
Verifying the existence of mandatory attributes. ... ok
Verifying the object class ... ok
Verifying single-valued attributes only have one value. ... ok
Validating data types. ... ok
Verifying that attributes are not empty. ... ok
Verifying the existence of mandatory attributes. ... ok
Verifying the object class ... ok
Verifying single-valued attributes only have one value. ... ok
Validating data types. ... ok
Verifying that attributes are not empty. ... ok
Verifying the existence of mandatory attributes. ... ok
Verifying the object class ... ok
Verifying single-valued attributes only have one value. ... ok
Validating data types. ... ok
Verifying that attributes are not empty. ... ok
Verifying the existence of mandatory attributes. ... ok
Verifying the object class ... ok
Verifying single-valued attributes only have one value. ... ok
Validating data types. ... ok
Verifying that attributes are not empty. ... ok
Verifying the existence of mandatory attributes. ... ok
Verifying the object class ... ok
Verifying single-valued attributes only have one value. ... ok
Validating data types. ... ok
Verifying that attributes are not empty. ... ok
Verifying the existence of mandatory attributes. ... ok
Verifying the object class ... ok
Verifying single-valued attributes only have one value. ... ok
Validating data types. ... ok
Verifying that attributes are not empty. ... ok
Verifying the existence of mandatory attributes. ... ok
Verifying the object class ... ok
Verifying single-valued attributes only have one value. ... ok
Validating data types. ... ok
Verifying that attributes are not empty. ... ok
Verifying the existence of mandatory attributes. ... ok
Verifying the object class ... ok
Verifying single-valued attributes only have one value. ... ok
Validating data types. ... FAIL
Verifying that attributes are not empty. ... ok
Verifying the existence of mandatory attributes. ... ok
Verifying the object class ... ok
Verifying single-valued attributes only have one value. ... ok
Validating data types. ... ok
Verifying that attributes are not empty. ... ok
Verifying the existence of mandatory attributes. ... ok
Verifying the object class ... ok
Verifying single-valued attributes only have one value. ... ok
Validating data types. ... ok
Verifying that attributes are not empty. ... ok
Verifying the existence of mandatory attributes. ... ok
Verifying the object class ... ok
Verifying single-valued attributes only have one value. ... ok
Validating data types. ... ok
Verifying that attributes are not empty. ... ok
Verifying the existence of mandatory attributes. ... ok
Verifying the object class ... ok
Verifying single-valued attributes only have one value. ... ok
Validating data types. ... ok
Verifying that attributes are not empty. ... ok
Verifying the existence of mandatory attributes. ... ok
Verifying the object class ... ok
Verifying single-valued attributes only have one value. ... ok
Validating data types. ... ok
Verifying that attributes are not empty. ... ok
Verifying the existence of mandatory attributes. ... ok
Verifying the object class ... ok
Verifying single-valued attributes only have one value. ... ok
Validating data types. ... ok
Verifying that attributes are not empty. ... ok
Verifying the existence of mandatory attributes. ... ok
Verifying the object class ... ok
Verifying single-valued attributes only have one value. ... ok
Validating data types. ... FAIL
Verifying that attributes are not empty. ... ok
Verifying the existence of mandatory attributes. ... ok
Verifying the object class ... ok
Verifying single-valued attributes only have one value. ... ok
Validating data types. ... ok
Verifying that attributes are not empty. ... ok
Verifying the existence of mandatory attributes. ... ok
Verifying the object class ... ok
Verifying single-valued attributes only have one value. ... ok
Validating data types. ... ok
Verifying that attributes are not empty. ... ok
Verifying the existence of mandatory attributes. ... ok
Verifying the object class ... ok
Verifying single-valued attributes only have one value. ... ok
Validating data types. ... ok
Verifying that attributes are not empty. ... ok
Verifying the existence of mandatory attributes. ... ok
Verifying the object class ... ok
Verifying single-valued attributes only have one value. ... ok
Validating data types. ... ok
Verifying that attributes are not empty. ... ok
Verifying the existence of mandatory attributes. ... ok
Verifying the object class ... ok
Verifying single-valued attributes only have one value. ... ok
Validating data types. ... ok
Verifying that attributes are not empty. ... ok
Verifying the existence of mandatory attributes. ... ok
Verifying the object class ... ok
Verifying single-valued attributes only have one value. ... ok
Validating data types. ... ok
Verifying that attributes are not empty. ... ok
Verifying the existence of mandatory attributes. ... ok
Verifying the object class ... ok
Verifying single-valued attributes only have one value. ... ok
Validating data types. ... ok
Verifying that attributes are not empty. ... ok
Verifying the existence of mandatory attributes. ... ok
Verifying the object class ... ok
Verifying single-valued attributes only have one value. ... ok
Validating data types. ... ok
Verifying that attributes are not empty. ... ok
Verifying the existence of mandatory attributes. ... ok
Verifying the object class ... ok
Verifying single-valued attributes only have one value. ... ok
Validating data types. ... ok
Verifying that attributes are not empty. ... ok
Verifying the existence of mandatory attributes. ... ok
Verifying the object class ... ok
Verifying single-valued attributes only have one value. ... ok
Validating data types. ... ok
Verifying that attributes are not empty. ... ok
Verifying the existence of mandatory attributes. ... ok
Verifying the object class ... ok
Verifying single-valued attributes only have one value. ... ok
Validating data types. ... ok
Verifying that attributes are not empty. ... ok
Verifying the existence of mandatory attributes. ... ok
Verifying the object class ... ok
Verifying single-valued attributes only have one value. ... ok
Validating data types. ... ok
Verifying that attributes are not empty. ... ok
Verifying the existence of mandatory attributes. ... ok
Verifying the object class ... ok
Verifying single-valued attributes only have one value. ... ok
Validating data types. ... ok
Verifying that attributes are not empty. ... ok
Verifying the existence of mandatory attributes. ... ok
Verifying the object class ... ok
Verifying single-valued attributes only have one value. ... ok

======================================================================
FAIL: Validating data types.
----------------------------------------------------------------------
Traceback (most recent call last):
  File "/usr/lib/python2.6/site-packages/validator/EntryTest.py", line 71, in test_data_types
    self.assertTrue(check(value), message)
AssertionError: WARNING: The field GLUE2EndpointServingState with value 'testing' does not follow the type ServingState_t in GLUE2EndpointID=cream-23.pd.infn.it_ComputingElement_org.glite.ce.CREAM,GLUE2ServiceID=cream-23.pd.infn.it_ComputingElement,GLUE2GroupID=resource,o=glue

======================================================================
FAIL: Validating data types.
----------------------------------------------------------------------
Traceback (most recent call last):
  File "/usr/lib/python2.6/site-packages/validator/EntryTest.py", line 71, in test_data_types
    self.assertTrue(check(value), message)
AssertionError: WARNING: The field GLUE2BenchmarkType with value 'HEP-SPEC06' does not follow the type Benchmark_t in GLUE2BenchmarkID=cream-23.pd.infn.it_HEP-SPEC06,GLUE2ResourceID=cream-23.pd.infn.it,GLUE2ServiceID=cream-23.pd.infn.it_ComputingElement,GLUE2GroupID=resource,o=glue

----------------------------------------------------------------------
Ran 160 tests in 0.048s

FAILED (failures=2)

$ glue-validator -t glue2 -h cream-30.pd.infn.it -p 2170 -b o=glue
Validating data types. ... ok
Verifying that attributes are not empty. ... ok
Verifying the existence of mandatory attributes. ... ok
Verifying the object class ... ok
Verifying single-valued attributes only have one value. ... ok
Validating data types. ... ok
Verifying that attributes are not empty. ... ok
Verifying the existence of mandatory attributes. ... ok
Verifying the object class ... ok
Verifying single-valued attributes only have one value. ... ok
Validating data types. ... ok
Verifying that attributes are not empty. ... ok
Verifying the existence of mandatory attributes. ... ok
Verifying the object class ... ok
Verifying single-valued attributes only have one value. ... ok
Validating data types. ... FAIL
Verifying that attributes are not empty. ... ok
Verifying the existence of mandatory attributes. ... ok
Verifying the object class ... ok
Verifying single-valued attributes only have one value. ... ok
Validating data types. ... ok
Verifying that attributes are not empty. ... ok
Verifying the existence of mandatory attributes. ... ok
Verifying the object class ... ok
Verifying single-valued attributes only have one value. ... ok
Validating data types. ... ok
Verifying that attributes are not empty. ... ok
Verifying the existence of mandatory attributes. ... ok
Verifying the object class ... ok
Verifying single-valued attributes only have one value. ... ok
Validating data types. ... ok
Verifying that attributes are not empty. ... ok
Verifying the existence of mandatory attributes. ... ok
Verifying the object class ... ok
Verifying single-valued attributes only have one value. ... ok
Validating data types. ... ok
Verifying that attributes are not empty. ... ok
Verifying the existence of mandatory attributes. ... ok
Verifying the object class ... ok
Verifying single-valued attributes only have one value. ... ok
Validating data types. ... ok
Verifying that attributes are not empty. ... ok
Verifying the existence of mandatory attributes. ... ok
Verifying the object class ... ok
Verifying single-valued attributes only have one value. ... ok
Validating data types. ... ok
Verifying that attributes are not empty. ... ok
Verifying the existence of mandatory attributes. ... ok
Verifying the object class ... ok
Verifying single-valued attributes only have one value. ... ok
Validating data types. ... ok
Verifying that attributes are not empty. ... ok
Verifying the existence of mandatory attributes. ... ok
Verifying the object class ... ok
Verifying single-valued attributes only have one value. ... ok
Validating data types. ... ok
Verifying that attributes are not empty. ... ok
Verifying the existence of mandatory attributes. ... ok
Verifying the object class ... ok
Verifying single-valued attributes only have one value. ... ok
Validating data types. ... ok
Verifying that attributes are not empty. ... ok
Verifying the existence of mandatory attributes. ... ok
Verifying the object class ... ok
Verifying single-valued attributes only have one value. ... ok
Validating data types. ... ok
Verifying that attributes are not empty. ... ok
Verifying the existence of mandatory attributes. ... ok
Verifying the object class ... ok
Verifying single-valued attributes only have one value. ... ok
Validating data types. ... ok
Verifying that attributes are not empty. ... ok
Verifying the existence of mandatory attributes. ... ok
Verifying the object class ... ok
Verifying single-valued attributes only have one value. ... ok
Validating data types. ... ok
Verifying that attributes are not empty. ... ok
Verifying the existence of mandatory attributes. ... ok
Verifying the object class ... ok
Verifying single-valued attributes only have one value. ... ok
Validating data types. ... ok
Verifying that attributes are not empty. ... ok
Verifying the existence of mandatory attributes. ... ok
Verifying the object class ... ok
Verifying single-valued attributes only have one value. ... ok
Validating data types. ... ok
Verifying that attributes are not empty. ... ok
Verifying the existence of mandatory attributes. ... ok
Verifying the object class ... ok
Verifying single-valued attributes only have one value. ... ok
Validating data types. ... ok
Verifying that attributes are not empty. ... ok
Verifying the existence of mandatory attributes. ... ok
Verifying the object class ... ok
Verifying single-valued attributes only have one value. ... ok
Validating data types. ... ok
Verifying that attributes are not empty. ... ok
Verifying the existence of mandatory attributes. ... ok
Verifying the object class ... ok
Verifying single-valued attributes only have one value. ... ok
Validating data types. ... ok
Verifying that attributes are not empty. ... ok
Verifying the existence of mandatory attributes. ... ok
Verifying the object class ... ok
Verifying single-valued attributes only have one value. ... ok
Validating data types. ... ok
Verifying that attributes are not empty. ... ok
Verifying the existence of mandatory attributes. ... ok
Verifying the object class ... ok
Verifying single-valued attributes only have one value. ... ok
Validating data types. ... ok
Verifying that attributes are not empty. ... ok
Verifying the existence of mandatory attributes. ... ok
Verifying the object class ... ok
Verifying single-valued attributes only have one value. ... ok
Validating data types. ... FAIL
Verifying that attributes are not empty. ... ok
Verifying the existence of mandatory attributes. ... ok
Verifying the object class ... ok
Verifying single-valued attributes only have one value. ... ok
Validating data types. ... ok
Verifying that attributes are not empty. ... ok
Verifying the existence of mandatory attributes. ... ok
Verifying the object class ... ok
Verifying single-valued attributes only have one value. ... ok
Validating data types. ... ok
Verifying that attributes are not empty. ... ok
Verifying the existence of mandatory attributes. ... ok
Verifying the object class ... ok
Verifying single-valued attributes only have one value. ... ok
Validating data types. ... ok
Verifying that attributes are not empty. ... ok
Verifying the existence of mandatory attributes. ... ok
Verifying the object class ... ok
Verifying single-valued attributes only have one value. ... ok

======================================================================
FAIL: Validating data types.
----------------------------------------------------------------------
Traceback (most recent call last):
  File "/usr/lib/python2.6/site-packages/validator/EntryTest.py", line 71, in test_data_types
    self.assertTrue(check(value), message)
AssertionError: WARNING: The field GLUE2EndpointServingState with value 'testjra1' does not follow the type ServingState_t in GLUE2EndpointID=cream-30.pd.infn.it_ComputingElement_org.glite.ce.CREAM,GLUE2ServiceID=cream-30.pd.infn.it_ComputingElement,GLUE2GroupID=resource,o=glue

======================================================================
FAIL: Validating data types.
----------------------------------------------------------------------
Traceback (most recent call last):
  File "/usr/lib/python2.6/site-packages/validator/EntryTest.py", line 71, in test_data_types
    self.assertTrue(check(value), message)
AssertionError: WARNING: The field GLUE2ExecutionEnvironmentPlatform with value 'x86_64' does not follow the type Platform_t in GLUE2ResourceID=cream-30.pd.infn.it,GLUE2ServiceID=cream-30.pd.infn.it_ComputingElement,GLUE2GroupID=resource,o=glue
 
Changed:
<
<
Tests described:
>
>

Ran 135 tests in 0.070s
 
Added:
>
>
FAILED (failures=2) Errors are because of use of a State value not defined in the default glue-validator table.
 
Line: 133 to 836
 
META FILEATTACHMENT attachment="update_repo.log" attr="" comment="" date="1361978067" name="update_repo.log" path="update_repo.log" size="16554" user="SaraBertocco" version="1"
META FILEATTACHMENT attachment="functionality_lsf.log" attr="" comment="" date="1362066216" name="functionality_lsf.log" path="functionality_lsf.log" size="274634" user="SaraBertocco" version="1"
META FILEATTACHMENT attachment="pbs_update_repo.log" attr="" comment="" date="1362067904" name="pbs_update_repo.log" path="pbs_update_repo.log" size="19422" user="SaraBertocco" version="1"
Added:
>
>
META FILEATTACHMENT attachment="functionality_pbs.log" attr="" comment="" date="1362074125" name="functionality_pbs.log" path="functionality_pbs.log" size="273009" user="SaraBertocco" version="1"

Revision 42013-02-28 - SaraBertocco

Line: 1 to 1
 
META TOPICPARENT name="TestingCreamDgas"

Testing report: IGIRTC-132

Line: 22 to 22
 

Upgrade Installation

Changed:
<
<

CREAM LSF

>
>

CREAM LSF PASSED

 
Changed:
<
<

CREAM PBS

    • [[][Update log file]]
    • [[][Configuration log file]]
>
>

CREAM PBS PASSED

 

Unit Tests

System tests

Line: 37 to 37
 

CREAM PBS

Changed:
<
<

CREAM LSF

>
>

CREAM LSF PASSED

$ /usr/bin/pybot  -i simple -i isb_baseuri -i isb_client -i isb_gsiftp -i osb_localhost -i osb_basedesturi -i osb_desturi -i env -i epilogue -i prologue -i deleg -i cancel -i list -i susp_res -i man_cancel -i en_dis_sub -i purge -i ban -i sb_stage /opt/cream_test/testsuite/cream_test_suite.html
INFO: The files of this testsuite will be stored under: /tmp/tmpZVVMLT.cream_testing/
INFO: Non-mandatory variable "sec_cert" has not been set.
INFO: Non-mandatory variable "sec_key" has not been set.
INFO: Non-mandatory variable "sec_proxy_pass" has not been set.
==============================================================================
Cream Test Suite :: This is the main testing module,needed for testing the ...
==============================================================================
Simple Submit :: Execute /bin/uname -a.Submit the jdl and wait for... | PASS |
------------------------------------------------------------------------------
ISB Base URI :: Execute a bash shell script.The script is stored i... | PASS |
------------------------------------------------------------------------------
ISB Client to CE :: Execute a bash shell script.The script is stor... | PASS |
------------------------------------------------------------------------------
ISB gsiftp to CE :: Execute a bash shell script.The script is stor... | PASS |
------------------------------------------------------------------------------
OSB localhost :: Execute /bin/uname -a.Store std out and error str... | PASS |
------------------------------------------------------------------------------
OSB gsiftp BaseDestURI :: Execute /bin/uname -a.Store std out and ... | PASS |
------------------------------------------------------------------------------
OSB gsiftp DestURI :: Execute /bin/uname -a.Store std out and erro... | PASS |
------------------------------------------------------------------------------
Environment :: Execute a bash shell script.The script is stored lo... | PASS |
------------------------------------------------------------------------------
Epilogue :: Execute two bash shell scripts,one for the job and the... | PASS |
------------------------------------------------------------------------------
Prologue :: Execute two bash shell scripts,one for the job and the... | PASS |
------------------------------------------------------------------------------
Explicit Delegation :: Test job submission with explicit delegatio... | PASS |
------------------------------------------------------------------------------
Job Cancel :: Test job cancellation.Two cases are tested:             | PASS |
------------------------------------------------------------------------------
Job List :: Test the job listing cli utility.Store the list of the... | PASS |
------------------------------------------------------------------------------
Job Suspend - Resume :: Submit a job and suspend it.Wait until it'... | PASS |
------------------------------------------------------------------------------
Manually Cancel Job :: Submit a job and then manually cancel it on... | PASS |
------------------------------------------------------------------------------
Enable - Disable Submission :: This test case tests the proper fun... | PASS |
------------------------------------------------------------------------------
Job Purge :: This test case verifies the proper functionality of t... | PASS |
------------------------------------------------------------------------------
Ban User :: This test case tests if the banning of user works. The... | PASS |
------------------------------------------------------------------------------
Sandbox Staging :: This test case tests the two different Sandbox ... | PASS |
------------------------------------------------------------------------------
Cream Test Suite :: This is the main testing module,needed for tes... | PASS |
19 critical tests, 19 passed, 0 failed
19 tests total, 19 passed, 0 failed
==============================================================================
Output:  /home/bertocco/output.xml
Log:     /home/bertocco/log.html
Report:  /home/bertocco/report.html
 

Regression tests

Verification attached bugs for CREAM Torque

Line: 77 to 131
 

META FILEATTACHMENT attachment="update_repo.log" attr="" comment="" date="1361978067" name="update_repo.log" path="update_repo.log" size="16554" user="SaraBertocco" version="1"
Added:
>
>
META FILEATTACHMENT attachment="functionality_lsf.log" attr="" comment="" date="1362066216" name="functionality_lsf.log" path="functionality_lsf.log" size="274634" user="SaraBertocco" version="1"
META FILEATTACHMENT attachment="pbs_update_repo.log" attr="" comment="" date="1362067904" name="pbs_update_repo.log" path="pbs_update_repo.log" size="19422" user="SaraBertocco" version="1"

Revision 32013-02-27 - SaraBertocco

Line: 1 to 1
 
META TOPICPARENT name="TestingCreamDgas"

Testing report: IGIRTC-132

Line: 22 to 22
 

Upgrade Installation

Deleted:
<
<

CREAM PBS

    • [[][Update log file]]
    • [[][Configuration log file]]
 

CREAM LSF

Added:
>
>

CREAM PBS

 
    • [[][Update log file]]
    • [[][Configuration log file]]
Line: 74 to 74
 

-- SaraBertocco - 2013-02-27 \ No newline at end of file

Added:
>
>

META FILEATTACHMENT attachment="update_repo.log" attr="" comment="" date="1361978067" name="update_repo.log" path="update_repo.log" size="16554" user="SaraBertocco" version="1"

Revision 22013-02-27 - SaraBertocco

Line: 1 to 1
 
META TOPICPARENT name="TestingCreamDgas"

Testing report: IGIRTC-132

Line: 20 to 20
 

Deployment tests

Deleted:
<
<

Clean Installation

CREAM PBS

    • [[][Installation log file]]
    • [[][Configuration log file]]

CREAM LSF

    • [[][Installation log file]]
    • [[][Configuration log file]]
 

Upgrade Installation

CREAM PBS

Revision 12013-02-27 - SaraBertocco

Line: 1 to 1
Added:
>
>
META TOPICPARENT name="TestingCreamDgas"

Testing report: IGIRTC-132

Summary

  • Product: CREAM v. 1.13.5
  • Release Task: Task #40087
  • ETICS Subsystem Configuration Name:
  • VCS Tag:
  • EMI Major Release: EMI 1 (Kebnekaise)
  • Platform: SL5 epel
  • Author: Sara Bertocco
  • Testing report: [[][Testing Report file]]
  • Certification report: [[][Certification Report file]]
  • Outcome: "In Certification*

Deployment tests

Clean Installation

CREAM PBS

    • [[][Installation log file]]
    • [[][Configuration log file]]

CREAM LSF

    • [[][Installation log file]]
    • [[][Configuration log file]]

Upgrade Installation

CREAM PBS

    • [[][Update log file]]
    • [[][Configuration log file]]

CREAM LSF

    • [[][Update log file]]
    • [[][Configuration log file]]

Unit Tests

System tests

Functionality tests

CREAM PBS

CREAM LSF

Regression tests

Verification attached bugs for CREAM Torque

Bug # FIXED

Verification attached bugs for CREAM LSF

Bug #97441: CREAM: Unwanted auto-updating of the field "creationTime" on the creamdb database FIXED

Standard conformance tests

Glue 1 Compliance

  • glue-validator -t glue1 -h cert-41.pd.infn.it -p 2170 -b o=grid 
    log

Glue 2 Compliance

Performance and scalability tests

Integration testing

Tests described:

-- SaraBertocco - 2013-02-27

 
This site is powered by the TWiki collaboration platformCopyright © 2008-2019 by the contributing authors. All material on this collaboration platform is the property of the contributing authors.
Ideas, requests, problems regarding TWiki? Send feedback