Difference: EMI2CREAMTask21059 (14 vs. 15)

Revision 152012-05-07 - SergioTraldi

Line: 1 to 1
 
META TOPICPARENT name="TestingCreamDgas"

Testing and Certification report savannah task #21059 CREAM v. 1.14.0 (EMI2)

Line: 612 to 612
 

Glue 1 Compliance

Result: PASSED
Changed:
<
<
[root@cream-48 ~]# sudo glue-validator -t glue1 -h cream-48.pd.infn.it -p 2170 -b o=grid
>
>
[root@cream-48 ~]# glue-validator -t glue1 -h cream-48.pd.infn.it -p 2170 -b o=grid
 Validating data types. ... ok Verifying the existence of mandatory attributes. ... ok Verifying the object class ... ok
Line: 621 to 621
 Verifying the existence of mandatory attributes. ... ok Verifying the object class ... ok Verifying single-valued attributes only have one value. ... ok
Changed:
<
<
Validating data types. ... FAIL
>
>
Validating data types. ... ok
 Verifying the existence of mandatory attributes. ... ok Verifying the object class ... ok Verifying single-valued attributes only have one value. ... ok
Line: 665 to 665
 Verifying the existence of mandatory attributes. ... ok Verifying the object class ... ok Verifying single-valued attributes only have one value. ... ok
Changed:
<
<
Validating data types. ... FAIL
>
>
Validating data types. ... ok
 Verifying the existence of mandatory attributes. ... ok Verifying the object class ... ok Verifying single-valued attributes only have one value. ... ok
Line: 694 to 694
 Verifying the object class ... ok Verifying single-valued attributes only have one value. ... ok
Deleted:
<
<
================================================================== FAIL: Validating data types.
Traceback (most recent call last): File "/usr/lib/python2.4/site-packages/validator/EntryTest.py", line 60, in test_data_types self.assertTrue(check(value), message) AssertionError: The field GlueCEInfoDefaultSE with value '' does not follow the type String in GlueVOViewLocalID=enmr.eu,GlueCEUniqueID=cream-48.pd.infn.it:8443/cream-lsf-cert,Mds-Vo-name=resource,o=grid

================================================================== FAIL: Validating data types.


Traceback (most recent call last): File "/usr/lib/python2.4/site-packages/validator/EntryTest.py", line 60, in test_data_types self.assertTrue(check(value), message) AssertionError: The field GlueCEInfoDefaultSE with value '' does not follow the type String in GlueVOViewLocalID=infngrid,GlueCEUniqueID=cream-48.pd.infn.it:8443/cream-lsf-cert,Mds-Vo-name=resource,o=grid
 
Changed:
<
<
Ran 80 tests in 0.017s
>
>
Ran 80 tests in 0.033s
 
Changed:
<
<
FAILED (failures=2)
>
>
OK
 

for sl6: - to add

Line: 725 to 709
 for SL5:
Changed:
<
<
[root@cream-48 ~]# sudo glue-validator -t glue2 -h cream-48.pd.infn.it -p 2170 -b o=glue Validating data types. ... ok
>
>
[root@cream-48 ~]# glue-validator -t glue2 -h cream-48.pd.infn.it -p 2170 -b o=glueValidating data types. ... ok
 Verifying the existence of mandatory attributes. ... ok Verifying the object class ... ok Verifying single-valued attributes only have one value. ... ok
Line: 820 to 803
 AssertionError: The field GLUE2EndpointCapability with value 'information.publication' does not follow the type Capability_t in GLUE2EndpointID=cream-48.pd.infn.it_ComputingElement_org.glite.ce.ApplicationPublisher_1068561884,GLUE2ServiceID=cream-48.pd.infn.it_ComputingElement,GLUE2GroupID=resource,o=glue


Changed:
<
<
Ran 84 tests in 0.042s
>
>
Ran 84 tests in 0.040s
  FAILED (failures=1)
Deleted:
<
<
 

For SL6: - to add

 
This site is powered by the TWiki collaboration platformCopyright © 2008-2020 by the contributing authors. All material on this collaboration platform is the property of the contributing authors.
Ideas, requests, problems regarding TWiki? Send feedback