Difference: EMI2CREAMTask31337 (13 vs. 14)

Revision 142012-08-29 - SergioTraldi

Line: 1 to 1
 
META TOPICPARENT name="TestingCreamDgas"

Testing report: IGIRTC-91

Line: 604 to 604
 Result: PASSED
Added:
>
>
[root@cream-30 ~]# glue-validator -t glue1 -h cream-30.pd.infn.it -p 2170 -b o=grid Validating data types. ... ok Verifying the existence of mandatory attributes. ... ok Verifying the object class ... ok Verifying single-valued attributes only have one value. ... ok Validating data types. ... ok Verifying the existence of mandatory attributes. ... ok Verifying the object class ... ok Verifying single-valued attributes only have one value. ... ok Validating data types. ... ok Verifying the existence of mandatory attributes. ... ok Verifying the object class ... ok Verifying single-valued attributes only have one value. ... ok Validating data types. ... ok Verifying the existence of mandatory attributes. ... ok Verifying the object class ... ok Verifying single-valued attributes only have one value. ... ok Validating data types. ... ok Verifying the existence of mandatory attributes. ... ok Verifying the object class ... ok Verifying single-valued attributes only have one value. ... ok Validating data types. ... ok Verifying the existence of mandatory attributes. ... ok Verifying the object class ... ok Verifying single-valued attributes only have one value. ... ok Validating data types. ... ok Verifying the existence of mandatory attributes. ... ok Verifying the object class ... ok Verifying single-valued attributes only have one value. ... ok Validating data types. ... ok Verifying the existence of mandatory attributes. ... ok Verifying the object class ... ok Verifying single-valued attributes only have one value. ... ok Validating data types. ... ok Verifying the existence of mandatory attributes. ... ok Verifying the object class ... ok Verifying single-valued attributes only have one value. ... ok Validating data types. ... ok Verifying the existence of mandatory attributes. ... ok Verifying the object class ... ok Verifying single-valued attributes only have one value. ... ok Validating data types. ... ok Verifying the existence of mandatory attributes. ... ok Verifying the object class ... ok Verifying single-valued attributes only have one value. ... ok Validating data types. ... ok Verifying the existence of mandatory attributes. ... ok Verifying the object class ... ok Verifying single-valued attributes only have one value. ... ok Validating data types. ... ok Verifying the existence of mandatory attributes. ... ok Verifying the object class ... ok Verifying single-valued attributes only have one value. ... ok Validating data types. ... ok Verifying the existence of mandatory attributes. ... ok Verifying the object class ... ok Verifying single-valued attributes only have one value. ... ok Validating data types. ... ok Verifying the existence of mandatory attributes. ... ok Verifying the object class ... ok Verifying single-valued attributes only have one value. ... ok Validating data types. ... ok Verifying the existence of mandatory attributes. ... ok Verifying the object class ... ok Verifying single-valued attributes only have one value. ... ok Validating data types. ... ok Verifying the existence of mandatory attributes. ... ok Verifying the object class ... ok Verifying single-valued attributes only have one value. ... ok Validating data types. ... ok Verifying the existence of mandatory attributes. ... ok Verifying the object class ... ok Verifying single-valued attributes only have one value. ... ok Validating data types. ... ok Verifying the existence of mandatory attributes. ... ok Verifying the object class ... ok Verifying single-valued attributes only have one value. ... ok Validating data types. ... ok Verifying the existence of mandatory attributes. ... ok Verifying the object class ... ok Verifying single-valued attributes only have one value. ... ok Validating data types. ... ok Verifying the existence of mandatory attributes. ... ok Verifying the object class ... ok Verifying single-valued attributes only have one value. ... ok Validating data types. ... ok Verifying the existence of mandatory attributes. ... ok Verifying the object class ... ok Verifying single-valued attributes only have one value. ... ok Validating data types. ... ok Verifying the existence of mandatory attributes. ... ok Verifying the object class ... ok Verifying single-valued attributes only have one value. ... ok Validating data types. ... ok Verifying the existence of mandatory attributes. ... ok Verifying the object class ... ok Verifying single-valued attributes only have one value. ... ok Validating data types. ... ok Verifying the existence of mandatory attributes. ... ok Verifying the object class ... ok Verifying single-valued attributes only have one value. ... ok Validating data types. ... ok Verifying the existence of mandatory attributes. ... ok Verifying the object class ... ok Verifying single-valued attributes only have one value. ... ok Validating data types. ... ok Verifying the existence of mandatory attributes. ... ok Verifying the object class ... ok Verifying single-valued attributes only have one value. ... ok Validating data types. ... ok Verifying the existence of mandatory attributes. ... ok Verifying the object class ... ok Verifying single-valued attributes only have one value. ... ok Validating data types. ... ok Verifying the existence of mandatory attributes. ... ok Verifying the object class ... ok Verifying single-valued attributes only have one value. ... ok Validating data types. ... ok Verifying the existence of mandatory attributes. ... ok Verifying the object class ... ok Verifying single-valued attributes only have one value. ... ok


Ran 120 tests in 0.026s

OK

 

Glue 2 Compliance

Line: 611 to 737
 Result: PASSED
Added:
>
>
[root@cream-30 ~]# glue-validator -t glue2 -h cream-30.pd.infn.it -p 2170 -b o=glue Validating data types. ... ok Verifying the existence of mandatory attributes. ... ok Verifying the object class ... ok Verifying single-valued attributes only have one value. ... ok Validating data types. ... ok Verifying the existence of mandatory attributes. ... ok Verifying the object class ... ok Verifying single-valued attributes only have one value. ... ok Validating data types. ... ok Verifying the existence of mandatory attributes. ... ok Verifying the object class ... ok Verifying single-valued attributes only have one value. ... ok Validating data types. ... ok Verifying the existence of mandatory attributes. ... ok Verifying the object class ... ok Verifying single-valued attributes only have one value. ... ok Validating data types. ... ok Verifying the existence of mandatory attributes. ... ok Verifying the object class ... ok Verifying single-valued attributes only have one value. ... ok Validating data types. ... ok Verifying the existence of mandatory attributes. ... ok Verifying the object class ... ok Verifying single-valued attributes only have one value. ... ok Validating data types. ... ok Verifying the existence of mandatory attributes. ... ok Verifying the object class ... ok Verifying single-valued attributes only have one value. ... ok Validating data types. ... ok Verifying the existence of mandatory attributes. ... ok Verifying the object class ... ok Verifying single-valued attributes only have one value. ... ok Validating data types. ... ok Verifying the existence of mandatory attributes. ... ok Verifying the object class ... ok Verifying single-valued attributes only have one value. ... ok Validating data types. ... ok Verifying the existence of mandatory attributes. ... ok Verifying the object class ... ok Verifying single-valued attributes only have one value. ... ok Validating data types. ... ok Verifying the existence of mandatory attributes. ... ok Verifying the object class ... ok Verifying single-valued attributes only have one value. ... ok Validating data types. ... ok Verifying the existence of mandatory attributes. ... ok Verifying the object class ... ok Verifying single-valued attributes only have one value. ... ok Validating data types. ... ok Verifying the existence of mandatory attributes. ... ok Verifying the object class ... ok Verifying single-valued attributes only have one value. ... ok Validating data types. ... ok Verifying the existence of mandatory attributes. ... ok Verifying the object class ... ok Verifying single-valued attributes only have one value. ... ok Validating data types. ... ok Verifying the existence of mandatory attributes. ... ok Verifying the object class ... ok Verifying single-valued attributes only have one value. ... ok Validating data types. ... ok Verifying the existence of mandatory attributes. ... ok Verifying the object class ... ok Verifying single-valued attributes only have one value. ... ok Validating data types. ... ok Verifying the existence of mandatory attributes. ... ok Verifying the object class ... ok Verifying single-valued attributes only have one value. ... ok Validating data types. ... ok Verifying the existence of mandatory attributes. ... ok Verifying the object class ... ok Verifying single-valued attributes only have one value. ... ok Validating data types. ... ok Verifying the existence of mandatory attributes. ... ok Verifying the object class ... ok Verifying single-valued attributes only have one value. ... ok Validating data types. ... ok Verifying the existence of mandatory attributes. ... ok Verifying the object class ... ok Verifying single-valued attributes only have one value. ... ok Validating data types. ... ok Verifying the existence of mandatory attributes. ... ok Verifying the object class ... ok Verifying single-valued attributes only have one value. ... ok Validating data types. ... ok Verifying the existence of mandatory attributes. ... ok Verifying the object class ... ok Verifying single-valued attributes only have one value. ... ok Validating data types. ... ok Verifying the existence of mandatory attributes. ... ok Verifying the object class ... ok Verifying single-valued attributes only have one value. ... ok Validating data types. ... ok Verifying the existence of mandatory attributes. ... ok Verifying the object class ... ok Verifying single-valued attributes only have one value. ... ok Validating data types. ... ok Verifying the existence of mandatory attributes. ... ok Verifying the object class ... ok Verifying single-valued attributes only have one value. ... ok Validating data types. ... ok Verifying the existence of mandatory attributes. ... ok Verifying the object class ... ok Verifying single-valued attributes only have one value. ... ok Validating data types. ... ok Verifying the existence of mandatory attributes. ... ok Verifying the object class ... ok Verifying single-valued attributes only have one value. ... ok Validating data types. ... ok Verifying the existence of mandatory attributes. ... ok Verifying the object class ... ok Verifying single-valued attributes only have one value. ... ok Validating data types. ... ok Verifying the existence of mandatory attributes. ... ok Verifying the object class ... ok Verifying single-valued attributes only have one value. ... ok Validating data types. ... ok Verifying the existence of mandatory attributes. ... ok Verifying the object class ... ok Verifying single-valued attributes only have one value. ... ok Validating data types. ... ok Verifying the existence of mandatory attributes. ... ok Verifying the object class ... ok Verifying single-valued attributes only have one value. ... ok Validating data types. ... ok Verifying the existence of mandatory attributes. ... ok Verifying the object class ... ok Verifying single-valued attributes only have one value. ... ok Validating data types. ... ok Verifying the existence of mandatory attributes. ... ok Verifying the object class ... ok Verifying single-valued attributes only have one value. ... ok Validating data types. ... FAIL Verifying the existence of mandatory attributes. ... ok Verifying the object class ... ok Verifying single-valued attributes only have one value. ... ok

================================================================== FAIL: Validating data types.


Traceback (most recent call last): File "/usr/lib/python2.4/site-packages/validator/EntryTest.py", line 60, in test_data_types self.assertTrue(check(value), message) AssertionError: The field GLUE2EndpointCapability with value 'information.publication' does not follow the type Capability_t in GLUE2EndpointID=cream-30.pd.infn.it_ComputingElement_org.glite.ce.ApplicationPublisher_1068561884,GLUE2ServiceID=cream-30.pd.infn.it_ComputingElement,GLUE2GroupID=resource,o=glue


Ran 136 tests in 0.016s

FAILED (failures=1)

 
 
This site is powered by the TWiki collaboration platformCopyright © 2008-2021 by the contributing authors. All material on this collaboration platform is the property of the contributing authors.
Ideas, requests, problems regarding TWiki? Send feedback