Difference: EMI2CREAMTask34043SL6 (1 vs. 13)

Revision 132013-03-18 - SaraBertocco

Line: 1 to 1
 
META TOPICPARENT name="EMI2CREAMTask34043"

Testing report: IGIRTC-133

Line: 290 to 290
 Report: /home/bertocco/report.html
  • Check resource bdii test log
Added:
>
>

CREAM SLURM PASSED

Reasons for excludes tests:
  • sb_stage tests the two different Sandbox staging operations available for the /etc/glite-ce-cream/cream-config.xml, LRMS and GSIFTP, but using slurm the LRMS mode is not running
  • bdii, outputdata, lb require that the ce is published by a top bdii and the ce under test is not published
  • jon_man requires two proxies and the certifier has one only
  • old_blah tests old blparser not supported in slurm
  • man_cancel is not supported by the testsuite for slurm
  • cpu_alloc tests mpi features and mpi is not configured in the used testbed

$  /usr/bin/pybot  -e sb_stage -e bdii -e glue -e job_man -e old_blah  -e man_cancel -e outputdata -e cpu_alloc -e lb /opt/cream_test/testsuite/cream_test_suite.html
INFO: The files of this testsuite will be stored under: /tmp/tmpnECjfv.cream_testing/
INFO: Non-mandatory variable "sec_cert" has not been set.
INFO: Non-mandatory variable "sec_key" has not been set.
INFO: Non-mandatory variable "argus_host" has not been set.
INFO: Non-mandatory variable "sec_proxy_pass" has not been set.
INFO: Non-mandatory variable "argus_root_pass" has not been set.
==============================================================================
Cream Test Suite :: This is the main testing module,needed for testing the ...
==============================================================================
Set Log Level :: Set the log level used for the test suite. This c... | PASS |
------------------------------------------------------------------------------
Check Executables :: Check whether the needed executables for the ... | PASS |
------------------------------------------------------------------------------
Simple Submit :: Execute /bin/uname -a.Submit the jdl and wait for... | PASS |
------------------------------------------------------------------------------
ISB Base URI :: Execute a bash shell script.The script is stored i... | PASS |
------------------------------------------------------------------------------
ISB Client to CE :: Execute a bash shell script.The script is stor... | PASS |
------------------------------------------------------------------------------
ISB gsiftp to CE :: Execute a bash shell script.The script is stor... | PASS |
------------------------------------------------------------------------------
OSB localhost :: Execute /bin/uname -a.Store std out and error str... | PASS |
------------------------------------------------------------------------------
OSB gsiftp BaseDestURI :: Execute /bin/uname -a.Store std out and ... | PASS |
------------------------------------------------------------------------------
OSB gsiftp DestURI :: Execute /bin/uname -a.Store std out and erro... | PASS |
------------------------------------------------------------------------------
Environment :: Execute a bash shell script.The script is stored lo... | PASS |
------------------------------------------------------------------------------
Epilogue :: Execute two bash shell scripts,one for the job and the... | PASS |
------------------------------------------------------------------------------
Prologue :: Execute two bash shell scripts,one for the job and the... | PASS |
------------------------------------------------------------------------------
Explicit Delegation :: Test job submission with explicit delegatio... | PASS |
------------------------------------------------------------------------------
Job Cancel :: Test job cancellation.Two cases are tested:             | PASS |
------------------------------------------------------------------------------
Job List :: Test the job listing cli utility.Store the list of the... | PASS |
------------------------------------------------------------------------------
Job Suspend - Resume :: Submit a job and suspend it.Wait until it'... | PASS |
------------------------------------------------------------------------------
Verify CE service info :: This test case verifies the output of th... | PASS |
------------------------------------------------------------------------------
Enable - Disable Submission :: This test case tests the proper fun... | PASS |
------------------------------------------------------------------------------
Job Purge :: This test case verifies the proper functionality of t... | PASS |
------------------------------------------------------------------------------
Limiter :: NOTE: This test case is about 25 minutes long!             | PASS |
------------------------------------------------------------------------------
Ban User :: This test case tests if the banning of user works. The... | PASS |
------------------------------------------------------------------------------
Automatic Proxy Purging :: This test case checks the automatic pro... | PASS |
------------------------------------------------------------------------------
Verify Job Status Output :: This test is checking the output of th... | PASS |
------------------------------------------------------------------------------
Automatic Job Purge :: This test case is testing the functionality... | PASS |
------------------------------------------------------------------------------
Proxy Renewal :: Submit a job lasting 20 minutes using a proxy val... | PASS |
------------------------------------------------------------------------------
Cream Test Suite :: This is the main testing module,needed for tes... | PASS |
25 critical tests, 25 passed, 0 failed
25 tests total, 25 passed, 0 failed
==============================================================================
Output:  /home/bertocco/mbutos_cream_testsuite/glite-testsuites-cream-1.0.7-0/output.xml
Log:     /home/bertocco/mbutos_cream_testsuite/glite-testsuites-cream-1.0.7-0/log.html
Report:  /home/bertocco/mbutos_cream_testsuite/glite-testsuites-cream-1.0.7-0/report.html

$  /usr/bin/pybot  -i glue /opt/cream_test/testsuite/cream_test_suite.html
...
==============================================================================
Cream Test Suite :: This is the main testing module,needed for testing the ...
==============================================================================
Validate Glue Schema :: Run the glue validator on the cream host.     | PASS |
------------------------------------------------------------------------------
Cream Test Suite :: This is the main testing module,needed for tes... | PASS |
1 critical test, 1 passed, 0 failed
1 test total, 1 passed, 0 failed
==============================================================================
Output:  /home/bertocco/mbutos_cream_testsuite/glite-testsuites-cream-1.0.7-0/output.xml
Log:     /home/bertocco/mbutos_cream_testsuite/glite-testsuites-cream-1.0.7-0/log.html
Report:  /home/bertocco/mbutos_cream_testsuite/glite-testsuites-cream-1.0.7-0/report.html
  • Validate glue schema test log
 

Standard conformance tests

Glue 1 Compliance

Line: 358 to 457
 
META FILEATTACHMENT attachment="task34043_Test_Report.txt" attr="" comment="" date="1363111222" name="task34043_Test_Report.txt" path="task34043_Test_Report.txt" size="8386" user="SaraBertocco" version="1"
META FILEATTACHMENT attachment="conf_emi_creamCE-SLURM.cert-08.20130311-125234.log" attr="" comment="" date="1363615330" name="conf_emi_creamCE-SLURM.cert-08.20130311-125234.log" path="conf_emi_creamCE-SLURM.cert-08.20130311-125234.log" size="48256" user="SaraBertocco" version="1"
META FILEATTACHMENT attachment="InstallCert-08.txt" attr="" comment="" date="1363615330" name="InstallCert-08.txt" path="InstallCert-08.txt" size="253496" user="SaraBertocco" version="1"
Added:
>
>
META FILEATTACHMENT attachment="task34043_functionality_slurm_sl6.log" attr="" comment="" date="1363620756" name="task34043_functionality_slurm_sl6.log" path="task34043_functionality_slurm_sl6.log" size="438981" user="SaraBertocco" version="1"
META FILEATTACHMENT attachment="glue_slurm.html.log" attr="" comment="" date="1363621293" name="glue_slurm.html.log" path="glue_slurm.html.log" size="167421" user="SaraBertocco" version="1"

Revision 122013-03-18 - SaraBertocco

Line: 1 to 1
 
META TOPICPARENT name="EMI2CREAMTask34043"

Testing report: IGIRTC-133

Line: 11 to 11
 
  • ETICS Subsystem Configuration Name: emi-cream-ce_R_1_15_1_1, emi-cream-ui_R_1_15_1_1
  • VCS Tag: emi-cream-ce-1.2.1-2, dynsched-generic-2.5.1-3, glite-ce-common-java-1.15.1-2, glite-ce-cream-api-java-1.15.1-2, glite-ce-cream-core-1.15.1-2, glite-ce-cream-es-1.15.1-2, glite-ce-cream-utils-1.3.1-4, glite-ce-wsdl-1.15.1-1, glite-ce-yaim-cream-ce-4.4.1-4, glite-jdl-api-java-3.3.1-2,
  • EMI Major Release: EMI 3 (Monte Bianco)
Changed:
<
<
  • Platform: SL5 epel
>
>
  • Platform: SL6 epel
 
Line: 30 to 30
 
Added:
>
>

CREAM SLURM PASSED

 

Upgrade Installation

CREAM PBS PASSED

Line: 352 to 356
 
META FILEATTACHMENT attachment="cream-test-monitored-lease-updated_cert-41.log" attr="" comment="" date="1363081999" name="cream-test-monitored-lease-updated_cert-41.log" path="cream-test-monitored-lease-updated_cert-41.log" size="155795" user="SaraBertocco" version="1"
META FILEATTACHMENT attachment="task34043_Certification_Report.txt" attr="" comment="" date="1363111222" name="task34043_Certification_Report.txt" path="task34043_Certification_Report.txt" size="3060" user="SaraBertocco" version="1"
META FILEATTACHMENT attachment="task34043_Test_Report.txt" attr="" comment="" date="1363111222" name="task34043_Test_Report.txt" path="task34043_Test_Report.txt" size="8386" user="SaraBertocco" version="1"
Added:
>
>
META FILEATTACHMENT attachment="conf_emi_creamCE-SLURM.cert-08.20130311-125234.log" attr="" comment="" date="1363615330" name="conf_emi_creamCE-SLURM.cert-08.20130311-125234.log" path="conf_emi_creamCE-SLURM.cert-08.20130311-125234.log" size="48256" user="SaraBertocco" version="1"
META FILEATTACHMENT attachment="InstallCert-08.txt" attr="" comment="" date="1363615330" name="InstallCert-08.txt" path="InstallCert-08.txt" size="253496" user="SaraBertocco" version="1"

Revision 112013-03-12 - SaraBertocco

Line: 1 to 1
 
META TOPICPARENT name="EMI2CREAMTask34043"

Testing report: IGIRTC-133

Line: 8 to 8
 
Changed:
<
<
  • ETICS Subsystem Configuration Name:
  • VCS Tag:
>
>
  • ETICS Subsystem Configuration Name: emi-cream-ce_R_1_15_1_1, emi-cream-ui_R_1_15_1_1
  • VCS Tag: emi-cream-ce-1.2.1-2, dynsched-generic-2.5.1-3, glite-ce-common-java-1.15.1-2, glite-ce-cream-api-java-1.15.1-2, glite-ce-cream-core-1.15.1-2, glite-ce-cream-es-1.15.1-2, glite-ce-cream-utils-1.3.1-4, glite-ce-wsdl-1.15.1-1, glite-ce-yaim-cream-ce-4.4.1-4, glite-jdl-api-java-3.3.1-2,
 
  • EMI Major Release: EMI 3 (Monte Bianco)
  • Platform: SL5 epel
  • Author: Sara Bertocco
Changed:
<
<
  • Testing report: [[][Testing Report file]]
  • Certification report: [[][Certification Report file]]
>
>
 
  • Outcome: "In Certification*
Line: 350 to 350
 
META FILEATTACHMENT attachment="cream-test-monitored-cancel_cert-41.log" attr="" comment="" date="1363021106" name="cream-test-monitored-cancel_cert-41.log" path="cream-test-monitored-cancel_cert-41.log" size="1006962" user="SaraBertocco" version="1"
META FILEATTACHMENT attachment="glue2_compliance_sl6_pbs.log" attr="" comment="" date="1363021635" name="glue2_compliance_sl6_pbs.log" path="glue2_compliance_sl6_pbs.log" size="10100" user="SaraBertocco" version="1"
META FILEATTACHMENT attachment="cream-test-monitored-lease-updated_cert-41.log" attr="" comment="" date="1363081999" name="cream-test-monitored-lease-updated_cert-41.log" path="cream-test-monitored-lease-updated_cert-41.log" size="155795" user="SaraBertocco" version="1"
Added:
>
>
META FILEATTACHMENT attachment="task34043_Certification_Report.txt" attr="" comment="" date="1363111222" name="task34043_Certification_Report.txt" path="task34043_Certification_Report.txt" size="3060" user="SaraBertocco" version="1"
META FILEATTACHMENT attachment="task34043_Test_Report.txt" attr="" comment="" date="1363111222" name="task34043_Test_Report.txt" path="task34043_Test_Report.txt" size="8386" user="SaraBertocco" version="1"

Revision 102013-03-12 - SaraBertocco

Line: 1 to 1
 
META TOPICPARENT name="EMI2CREAMTask34043"

Testing report: IGIRTC-133

Line: 306 to 306
 

Performance and scalability tests

Changed:
<
<

LSF

>
>

LSF PASSED

 
  • ./bin/cream-test-monitored-submit -r 30 -n 1000 -m 50 -C 50 -l log4py.conf -j jdl/testsandbox.jdl -R cert-41.pd.infn.it:8443/cream-lsf-cert
    log
  • ./bin/cream-test-monitored-cancel -r 30 -n 1000 -m 50 -C 50 -l log4py.conf -j jdl/simple.jdl -R cert-41.pd.infn.it:8443/cream-lsf-cert
    log
Changed:
<
<
>
>
  • ./bin/cream-test-monitored-lease-updated -r 60 -n 50 -m 10 -C 10 -l log4py.conf -W 1200 --vo dteam --valid 00:20 -R cert-41.pd.infn.it:8443/cream-lsf-cert
    
    log

PBS NA

 

Integration testing

Line: 338 to 341
 
META FILEATTACHMENT attachment="task34043_update_cream_lsf_sl6.log" attr="" comment="" date="1362763867" name="task34043_update_cream_lsf_sl6.log" path="task34043_update_cream_lsf_sl6.log" size="42038" user="SaraBertocco" version="1"
META FILEATTACHMENT attachment="task34043_config_update_cream_lsf_sl6.log" attr="" comment="" date="1362763867" name="task34043_config_update_cream_lsf_sl6.log" path="task34043_config_update_cream_lsf_sl6.log" size="12981" user="SaraBertocco" version="1"
META FILEATTACHMENT attachment="task34043_config_update_cream_pbs_sl6.log" attr="" comment="" date="1363009201" name="task34043_config_update_cream_pbs_sl6.log" path="task34043_config_update_cream_pbs_sl6.log" size="16060" user="SaraBertocco" version="1"
Changed:
<
<
META FILEATTACHMENT attachment="task34043_config_install_cream_pbs_sl6.log" attr="" comment="" date="1363016951" name="task34043_config_install_cream_pbs_sl6.log" path="task34043_config_install_cream_pbs_sl6.log" size="33361" user="SaraBertocco" version="1"
>
>
META FILEATTACHMENT attachment="task34043_config_install_cream_pbs_sl6.log" attr="" comment="" date="1363084954" name="task34043_config_install_cream_pbs_sl6.log" path="task34043_config_install_cream_pbs_sl6.log" size="15909" user="SaraBertocco" version="2"
 
META FILEATTACHMENT attachment="task34043_install_cream_pbs_sl6.log" attr="" comment="" date="1363016951" name="task34043_install_cream_pbs_sl6.log" path="task34043_install_cream_pbs_sl6.log" size="183290" user="SaraBertocco" version="1"
META FILEATTACHMENT attachment="cream-test-monitored-submit_cert-41.log" attr="" comment="" date="1363017745" name="cream-test-monitored-submit_cert-41.log" path="cream-test-monitored-submit_cert-41.log" size="860602" user="SaraBertocco" version="1"
META FILEATTACHMENT attachment="glue2_compliance_sl6_lsf.log" attr="" comment="" date="1363018025" name="glue2_compliance_sl6_lsf.log" path="glue2_compliance_sl6_lsf.log" size="9176" user="SaraBertocco" version="1"
Line: 346 to 349
 
META FILEATTACHMENT attachment="glue1_compliance_sl6_pbs.log" attr="" comment="" date="1363021025" name="glue1_compliance_sl6_pbs.log" path="glue1_compliance_sl6_pbs.log" size="7691" user="SaraBertocco" version="1"
META FILEATTACHMENT attachment="cream-test-monitored-cancel_cert-41.log" attr="" comment="" date="1363021106" name="cream-test-monitored-cancel_cert-41.log" path="cream-test-monitored-cancel_cert-41.log" size="1006962" user="SaraBertocco" version="1"
META FILEATTACHMENT attachment="glue2_compliance_sl6_pbs.log" attr="" comment="" date="1363021635" name="glue2_compliance_sl6_pbs.log" path="glue2_compliance_sl6_pbs.log" size="10100" user="SaraBertocco" version="1"
Added:
>
>
META FILEATTACHMENT attachment="cream-test-monitored-lease-updated_cert-41.log" attr="" comment="" date="1363081999" name="cream-test-monitored-lease-updated_cert-41.log" path="cream-test-monitored-lease-updated_cert-41.log" size="155795" user="SaraBertocco" version="1"

Revision 92013-03-11 - SaraBertocco

Line: 1 to 1
 
META TOPICPARENT name="EMI2CREAMTask34043"

Testing report: IGIRTC-133

Line: 22 to 22
 

Clean Installation

Changed:
<
<

CREAM PBS

  • [[][Installation log file]]
  • [[][Configuration log file]]
>
>

CREAM PBS PASSED

 

CREAM LSF PASSED

Line: 289 to 289
 

Standard conformance tests

Glue 1 Compliance

Changed:
<
<
  • glue-validator -t glue1 -h cert-41.pd.infn.it -p 2170 -b o=grid 
    log
>
>
LSF FAILED ?
  • glue-validator -t glue1 -h cert-41.pd.infn.it -p 2170 -b o=grid 
    log

PBS FAILED ?
  • glue-validator -t glue1 -h cert-42.pd.infn.it -p 2170 -b o=grid
    log
 

Glue 2 Compliance

Added:
>
>
LSF PASSED
  • glue-validator -t glue2 -h cert-41.pd.infn.it -p 2170 -b o=glue 
    log

PBS PASSED
  • glue-validator -t glue2 -h cert-42.pd.infn.it -p 2170 -b o=glue 
    log
 

Performance and scalability tests

Added:
>
>

LSF

  • ./bin/cream-test-monitored-submit -r 30 -n 1000 -m 50 -C 50 -l log4py.conf -j jdl/testsandbox.jdl -R cert-41.pd.infn.it:8443/cream-lsf-cert
    log
  • ./bin/cream-test-monitored-cancel -r 30 -n 1000 -m 50 -C 50 -l log4py.conf -j jdl/simple.jdl -R cert-41.pd.infn.it:8443/cream-lsf-cert
    log
  •  log
    
 

Integration testing

Tests described:

Line: 321 to 338
 
META FILEATTACHMENT attachment="task34043_update_cream_lsf_sl6.log" attr="" comment="" date="1362763867" name="task34043_update_cream_lsf_sl6.log" path="task34043_update_cream_lsf_sl6.log" size="42038" user="SaraBertocco" version="1"
META FILEATTACHMENT attachment="task34043_config_update_cream_lsf_sl6.log" attr="" comment="" date="1362763867" name="task34043_config_update_cream_lsf_sl6.log" path="task34043_config_update_cream_lsf_sl6.log" size="12981" user="SaraBertocco" version="1"
META FILEATTACHMENT attachment="task34043_config_update_cream_pbs_sl6.log" attr="" comment="" date="1363009201" name="task34043_config_update_cream_pbs_sl6.log" path="task34043_config_update_cream_pbs_sl6.log" size="16060" user="SaraBertocco" version="1"
Added:
>
>
META FILEATTACHMENT attachment="task34043_config_install_cream_pbs_sl6.log" attr="" comment="" date="1363016951" name="task34043_config_install_cream_pbs_sl6.log" path="task34043_config_install_cream_pbs_sl6.log" size="33361" user="SaraBertocco" version="1"
META FILEATTACHMENT attachment="task34043_install_cream_pbs_sl6.log" attr="" comment="" date="1363016951" name="task34043_install_cream_pbs_sl6.log" path="task34043_install_cream_pbs_sl6.log" size="183290" user="SaraBertocco" version="1"
META FILEATTACHMENT attachment="cream-test-monitored-submit_cert-41.log" attr="" comment="" date="1363017745" name="cream-test-monitored-submit_cert-41.log" path="cream-test-monitored-submit_cert-41.log" size="860602" user="SaraBertocco" version="1"
META FILEATTACHMENT attachment="glue2_compliance_sl6_lsf.log" attr="" comment="" date="1363018025" name="glue2_compliance_sl6_lsf.log" path="glue2_compliance_sl6_lsf.log" size="9176" user="SaraBertocco" version="1"
META FILEATTACHMENT attachment="glue1_compliance_sl6_lsf.log" attr="" comment="" date="1363020988" name="glue1_compliance_sl6_lsf.log" path="glue1_compliance_sl6_lsf.log" size="6534" user="SaraBertocco" version="1"
META FILEATTACHMENT attachment="glue1_compliance_sl6_pbs.log" attr="" comment="" date="1363021025" name="glue1_compliance_sl6_pbs.log" path="glue1_compliance_sl6_pbs.log" size="7691" user="SaraBertocco" version="1"
META FILEATTACHMENT attachment="cream-test-monitored-cancel_cert-41.log" attr="" comment="" date="1363021106" name="cream-test-monitored-cancel_cert-41.log" path="cream-test-monitored-cancel_cert-41.log" size="1006962" user="SaraBertocco" version="1"
META FILEATTACHMENT attachment="glue2_compliance_sl6_pbs.log" attr="" comment="" date="1363021635" name="glue2_compliance_sl6_pbs.log" path="glue2_compliance_sl6_pbs.log" size="10100" user="SaraBertocco" version="1"

Revision 82013-03-11 - SaraBertocco

Line: 1 to 1
 
META TOPICPARENT name="EMI2CREAMTask34043"

Testing report: IGIRTC-133

Line: 32 to 32
 

Upgrade Installation

Changed:
<
<

CREAM PBS

>
>

CREAM PBS PASSED

 
Line: 310 to 310
 -- SaraBertocco - 2013-03-04

META FILEATTACHMENT attachment="task34043_install_config_cream_lsf_sl5.log" attr="" comment="" date="1362479339" name="task34043_install_config_cream_lsf_sl5.log" path="task34043_install_config_cream_lsf_sl5.log" size="12835" user="SaraBertocco" version="1"
Changed:
<
<
META FILEATTACHMENT attachment="task34043_update_cream_pbs_sl6.log" attr="" comment="" date="1362494114" name="task34043_update_cream_pbs_sl6.log" path="task34043_update_cream_pbs_sl6.log" size="33043" user="SaraBertocco" version="1"
>
>
META FILEATTACHMENT attachment="task34043_update_cream_pbs_sl6.log" attr="" comment="" date="1363009201" name="task34043_update_cream_pbs_sl6.log" path="task34043_update_cream_pbs_sl6.log" size="39884" user="SaraBertocco" version="2"
 
META FILEATTACHMENT attachment="task34043_conf_update_cream_pbs_sl6.log" attr="" comment="" date="1362494114" name="task34043_conf_update_cream_pbs_sl6.log" path="task34043_conf_update_cream_pbs_sl6.log" size="15913" user="SaraBertocco" version="1"
META FILEATTACHMENT attachment="task34043_functionality_pbs_sl6.log" attr="" comment="" date="1362570755" name="task34043_functionality_pbs_sl6.log" path="task34043_functionality_pbs_sl6.log" size="544905" user="SaraBertocco" version="1"
META FILEATTACHMENT attachment="task34043_functionality_lsf_sl6.log" attr="" comment="" date="1362587189" name="task34043_functionality_lsf_sl6.log" path="task34043_functionality_lsf_sl6.log" size="531585" user="SaraBertocco" version="1"
Line: 320 to 320
 
META FILEATTACHMENT attachment="task34043_conf_install_cream_lsf_sl6.log" attr="" comment="" date="1362588947" name="task34043_conf_install_cream_lsf_sl6.log" path="task34043_conf_install_cream_lsf_sl6.log" size="12598" user="SaraBertocco" version="1"
META FILEATTACHMENT attachment="task34043_update_cream_lsf_sl6.log" attr="" comment="" date="1362763867" name="task34043_update_cream_lsf_sl6.log" path="task34043_update_cream_lsf_sl6.log" size="42038" user="SaraBertocco" version="1"
META FILEATTACHMENT attachment="task34043_config_update_cream_lsf_sl6.log" attr="" comment="" date="1362763867" name="task34043_config_update_cream_lsf_sl6.log" path="task34043_config_update_cream_lsf_sl6.log" size="12981" user="SaraBertocco" version="1"
Added:
>
>
META FILEATTACHMENT attachment="task34043_config_update_cream_pbs_sl6.log" attr="" comment="" date="1363009201" name="task34043_config_update_cream_pbs_sl6.log" path="task34043_config_update_cream_pbs_sl6.log" size="16060" user="SaraBertocco" version="1"

Revision 72013-03-08 - SaraBertocco

Line: 1 to 1
 
META TOPICPARENT name="EMI2CREAMTask34043"

Testing report: IGIRTC-133

Line: 26 to 26
 
  • [[][Installation log file]]
  • [[][Configuration log file]]
Changed:
<
<

CREAM LSF

>
>

CREAM LSF PASSED

 
Line: 36 to 36
 
Changed:
<
<

CREAM LSF

  • [[][Update log file]]
  • [[][Configuration log file]]
>
>

CREAM LSF PASSED

 

Unit Tests

Line: 46 to 46
 

Functionality tests

Changed:
<
<

CREAM PBS

>
>

CREAM PBS PASSED

 The "Verify Job Status Output" test fails because a bug in the UI EMI 2 used to launch the testsuite. Other tests are excluded for configuration issues.
$  pybot  -e bdii -e glue -e job_man -e old_blah  /opt/cream_test/testsuite/cream_test_suite.html
Line: 139 to 139
 
Changed:
<
<

CREAM LSF

>
>

CREAM LSF PASSED

 
  • job_man excluded because requires two proxyes which the certifier has not.
  • old_blah excluded because the ce is configured with new blah
  • OutputData usage check fails for configuration issues
Line: 318 to 318
 
META FILEATTACHMENT attachment="glue.html.log" attr="" comment="" date="1362588589" name="glue.html.log" path="glue.html.log" size="167391" user="SaraBertocco" version="1"
META FILEATTACHMENT attachment="task34043_install_cream_lsf_sl6.log" attr="" comment="" date="1362588947" name="task34043_install_cream_lsf_sl6.log" path="task34043_install_cream_lsf_sl6.log" size="176920" user="SaraBertocco" version="1"
META FILEATTACHMENT attachment="task34043_conf_install_cream_lsf_sl6.log" attr="" comment="" date="1362588947" name="task34043_conf_install_cream_lsf_sl6.log" path="task34043_conf_install_cream_lsf_sl6.log" size="12598" user="SaraBertocco" version="1"
Added:
>
>
META FILEATTACHMENT attachment="task34043_update_cream_lsf_sl6.log" attr="" comment="" date="1362763867" name="task34043_update_cream_lsf_sl6.log" path="task34043_update_cream_lsf_sl6.log" size="42038" user="SaraBertocco" version="1"
META FILEATTACHMENT attachment="task34043_config_update_cream_lsf_sl6.log" attr="" comment="" date="1362763867" name="task34043_config_update_cream_lsf_sl6.log" path="task34043_config_update_cream_lsf_sl6.log" size="12981" user="SaraBertocco" version="1"

Revision 62013-03-06 - SaraBertocco

Line: 1 to 1
 
META TOPICPARENT name="EMI2CREAMTask34043"

Testing report: IGIRTC-133

Line: 47 to 47
 

Functionality tests

CREAM PBS

Changed:
<
<
The "Verify Job Status Output" test fails because a bug in the UI EMI 2 used to launch the testsuite.
>
>
The "Verify Job Status Output" test fails because a bug in the UI EMI 2 used to launch the testsuite. Other tests are excluded for configuration issues.
 
$  pybot  -e bdii -e glue -e job_man -e old_blah  /opt/cream_test/testsuite/cream_test_suite.html
INFO: The files of this testsuite will be stored under: /tmp/tmpMzx6BW.cream_testing/
Line: 140 to 140
 

CREAM LSF

Added:
>
>
  • job_man excluded because requires two proxyes which the certifier has not.
  • old_blah excluded because the ce is configured with new blah
  • OutputData usage check fails for configuration issues
  • Logging and Bookkeeping check fails for UI installation issues.
$ /usr/bin/pybot  -e bdii -e glue -e job_man -e old_blah  /opt/cream_test/testsuite/cream_test_suite.html
INFO: The files of this testsuite will be stored under: /tmp/tmp1fA8m_.cream_testing/
INFO: Non-mandatory variable "sec_cert" has not been set.
INFO: Non-mandatory variable "sec_key" has not been set.
INFO: Non-mandatory variable "argus_host" has not been set.
INFO: Non-mandatory variable "sec_proxy_pass" has not been set.
INFO: Non-mandatory variable "argus_root_pass" has not been set.
==============================================================================
Cream Test Suite :: This is the main testing module,needed for testing the ...
==============================================================================
Set Log Level :: Set the log level used for the test suite. This c... | PASS |
------------------------------------------------------------------------------
Check Executables :: Check whether the needed executables for the ... | PASS |
------------------------------------------------------------------------------
Simple Submit :: Execute /bin/uname -a.Submit the jdl and wait for... | PASS |
------------------------------------------------------------------------------
ISB Base URI :: Execute a bash shell script.The script is stored i... | PASS |
------------------------------------------------------------------------------
ISB Client to CE :: Execute a bash shell script.The script is stor... | PASS |
------------------------------------------------------------------------------
ISB gsiftp to CE :: Execute a bash shell script.The script is stor... | PASS |
------------------------------------------------------------------------------
OSB localhost :: Execute /bin/uname -a.Store std out and error str... | PASS |
------------------------------------------------------------------------------
OSB gsiftp BaseDestURI :: Execute /bin/uname -a.Store std out and ... | PASS |
------------------------------------------------------------------------------
OSB gsiftp DestURI :: Execute /bin/uname -a.Store std out and erro... | PASS |
------------------------------------------------------------------------------
Environment :: Execute a bash shell script.The script is stored lo... | PASS |
------------------------------------------------------------------------------
Epilogue :: Execute two bash shell scripts,one for the job and the... | PASS |
------------------------------------------------------------------------------
Prologue :: Execute two bash shell scripts,one for the job and the... | PASS |
------------------------------------------------------------------------------
Explicit Delegation :: Test job submission with explicit delegatio... | PASS |
------------------------------------------------------------------------------
Job Cancel :: Test job cancellation.Two cases are tested:             | PASS |
------------------------------------------------------------------------------
Job List :: Test the job listing cli utility.Store the list of the... | PASS |
------------------------------------------------------------------------------
Job Suspend - Resume :: Submit a job and suspend it.Wait until it'... | PASS |
------------------------------------------------------------------------------
Manually Cancel Job :: Submit a job and then manually cancel it on... | PASS |
------------------------------------------------------------------------------
Verify CE service info :: This test case verifies the output of th... | PASS |
------------------------------------------------------------------------------
Enable - Disable Submission :: This test case tests the proper fun... | PASS |
------------------------------------------------------------------------------
Job Purge :: This test case verifies the proper functionality of t... | PASS |
------------------------------------------------------------------------------
Limiter :: NOTE: This test case is about 25 minutes long!             | PASS |
------------------------------------------------------------------------------
Ban User :: This test case tests if the banning of user works. The... | PASS |
------------------------------------------------------------------------------
Sandbox Staging :: This test case tests the two different Sandbox ... | PASS |
------------------------------------------------------------------------------
Automatic Proxy Purging :: This test case checks the automatic pro... | PASS |
------------------------------------------------------------------------------
Verify Job Status Output :: This test is checking the output of th... | PASS |
------------------------------------------------------------------------------
OutputData :: This test case tests the OutputData jdl attribute. T... | FAIL |
'[]' should not be empty
------------------------------------------------------------------------------
Automatic Job Purge :: This test case is testing the functionality... | PASS |
------------------------------------------------------------------------------
Proxy Renewal :: Submit a job lasting 20 minutes using a proxy val... | PASS |
------------------------------------------------------------------------------
CPU Allocation 1 :: Validate the contents of the batch job submiss... | PASS |
------------------------------------------------------------------------------
CPU Allocation 2 :: Validate the contents of the batch job submiss... | PASS |
------------------------------------------------------------------------------
CPU Allocation 3 :: Validate the contents of the batch job submiss... | PASS |
------------------------------------------------------------------------------
CPU Allocation 4 :: Validate the contents of the batch job submiss... | PASS |
------------------------------------------------------------------------------
CPU Allocation 5 :: Validate the contents of the batch job submiss... | PASS |
------------------------------------------------------------------------------
CPU Allocation 6 :: Validate the contents of the batch job submiss... | PASS |
------------------------------------------------------------------------------
Logging and Bookkeeping :: Check if the logging and bookkeeping se... | FAIL |
_error: WMS Job status polling failed with return value: 1
Command reported: Traceback (most recent call last):
,  File "/usr/bin/glite-wms-job-status", line 53, in <module>
,    import wmsui_utils
,ImportError: No module named wmsui_utils
------------------------------------------------------------------------------
Cream Test Suite :: This is the main testing module,needed for tes... | FAIL |
35 critical tests, 33 passed, 2 failed
35 tests total, 33 passed, 2 failed
==============================================================================
Output:  /home/bertocco/output.xml
Log:     /home/bertocco/log.html
Report:  /home/bertocco/report.html
 
Added:
>
>
$ /usr/bin/pybot  -i glue  /opt/cream_test/testsuite/cream_test_suite.html
INFO: The files of this testsuite will be stored under: /tmp/tmp48uh_f.cream_testing/
INFO: Non-mandatory variable "sec_cert" has not been set.
INFO: Non-mandatory variable "sec_key" has not been set.
INFO: Non-mandatory variable "argus_host" has not been set.
INFO: Non-mandatory variable "sec_proxy_pass" has not been set.
INFO: Non-mandatory variable "argus_root_pass" has not been set.
==============================================================================
Cream Test Suite :: This is the main testing module,needed for testing the ...
==============================================================================
Validate Glue Schema :: Run the glue validator on the cream host.     | PASS |
------------------------------------------------------------------------------
Cream Test Suite :: This is the main testing module,needed for tes... | PASS |
1 critical test, 1 passed, 0 failed
1 test total, 1 passed, 0 failed
==============================================================================
Output:  /home/bertocco/output.xml
Log:     /home/bertocco/log.html
Report:  /home/bertocco/report.html
  • Validate glue schema test log
 
Changed:
<
<

Regression tests

Verification attached bugs for CREAM Torque

Bug # FIXED

Verification attached bugs for CREAM LSF

Bug #97441: CREAM: Unwanted auto-updating of the field "creationTime" on the creamdb database FIXED
>
>
$ /usr/bin/pybot  -i bdii  /opt/cream_test/testsuite/cream_test_suite.html
INFO: The files of this testsuite will be stored under: /tmp/tmpWmVNrW.cream_testing/
INFO: Non-mandatory variable "sec_cert" has not been set.
INFO: Non-mandatory variable "sec_key" has not been set.
INFO: Non-mandatory variable "argus_host" has not been set.
INFO: Non-mandatory variable "sec_proxy_pass" has not been set.
INFO: Non-mandatory variable "argus_root_pass" has not been set.
==============================================================================
Cream Test Suite :: This is the main testing module,needed for testing the ...
==============================================================================
Resource BDII :: Check if the resource bdii publishes all the rele... | PASS |
------------------------------------------------------------------------------
Cream Test Suite :: This is the main testing module,needed for tes... | PASS |
1 critical test, 1 passed, 0 failed
1 test total, 1 passed, 0 failed
==============================================================================
Output:  /home/bertocco/output.xml
Log:     /home/bertocco/log.html
Report:  /home/bertocco/report.html
  • Check resource bdii test log
 

Standard conformance tests

Glue 1 Compliance

Line: 179 to 313
 
META FILEATTACHMENT attachment="task34043_update_cream_pbs_sl6.log" attr="" comment="" date="1362494114" name="task34043_update_cream_pbs_sl6.log" path="task34043_update_cream_pbs_sl6.log" size="33043" user="SaraBertocco" version="1"
META FILEATTACHMENT attachment="task34043_conf_update_cream_pbs_sl6.log" attr="" comment="" date="1362494114" name="task34043_conf_update_cream_pbs_sl6.log" path="task34043_conf_update_cream_pbs_sl6.log" size="15913" user="SaraBertocco" version="1"
META FILEATTACHMENT attachment="task34043_functionality_pbs_sl6.log" attr="" comment="" date="1362570755" name="task34043_functionality_pbs_sl6.log" path="task34043_functionality_pbs_sl6.log" size="544905" user="SaraBertocco" version="1"
Added:
>
>
META FILEATTACHMENT attachment="task34043_functionality_lsf_sl6.log" attr="" comment="" date="1362587189" name="task34043_functionality_lsf_sl6.log" path="task34043_functionality_lsf_sl6.log" size="531585" user="SaraBertocco" version="1"
META FILEATTACHMENT attachment="bdii.html.log" attr="" comment="" date="1362588589" name="bdii.html.log" path="bdii.html.log" size="179476" user="SaraBertocco" version="1"
META FILEATTACHMENT attachment="glue.html.log" attr="" comment="" date="1362588589" name="glue.html.log" path="glue.html.log" size="167391" user="SaraBertocco" version="1"
META FILEATTACHMENT attachment="task34043_install_cream_lsf_sl6.log" attr="" comment="" date="1362588947" name="task34043_install_cream_lsf_sl6.log" path="task34043_install_cream_lsf_sl6.log" size="176920" user="SaraBertocco" version="1"
META FILEATTACHMENT attachment="task34043_conf_install_cream_lsf_sl6.log" attr="" comment="" date="1362588947" name="task34043_conf_install_cream_lsf_sl6.log" path="task34043_conf_install_cream_lsf_sl6.log" size="12598" user="SaraBertocco" version="1"

Revision 52013-03-06 - SaraBertocco

Line: 1 to 1
 
META TOPICPARENT name="EMI2CREAMTask34043"

Testing report: IGIRTC-133

Line: 27 to 27
 
  • [[][Configuration log file]]

CREAM LSF

Changed:
<
<
  • [[][Installation log file]]
  • [[][Configuration log file]]
>
>
 

Upgrade Installation

Revision 42013-03-06 - SaraBertocco

Line: 1 to 1
 
META TOPICPARENT name="EMI2CREAMTask34043"

Testing report: IGIRTC-133

Line: 47 to 47
 

Functionality tests

CREAM PBS

Added:
>
>
The "Verify Job Status Output" test fails because a bug in the UI EMI 2 used to launch the testsuite.
$  pybot  -e bdii -e glue -e job_man -e old_blah  /opt/cream_test/testsuite/cream_test_suite.html
INFO: The files of this testsuite will be stored under: /tmp/tmpMzx6BW.cream_testing/
INFO: Non-mandatory variable "sec_cert" has not been set.
INFO: Non-mandatory variable "sec_key" has not been set.
INFO: Non-mandatory variable "argus_host" has not been set.
INFO: Non-mandatory variable "sec_proxy_pass" has not been set.
==============================================================================
Cream Test Suite :: This is the main testing module,needed for testing the ...
==============================================================================
Set Log Level :: Set the log level used for the test suite. This c... | PASS |
------------------------------------------------------------------------------
Check Executables :: Check whether the needed executables for the ... | PASS |
------------------------------------------------------------------------------
Simple Submit :: Execute /bin/uname -a.Submit the jdl and wait for... | PASS |
------------------------------------------------------------------------------
ISB Base URI :: Execute a bash shell script.The script is stored i... | PASS |
------------------------------------------------------------------------------
ISB Client to CE :: Execute a bash shell script.The script is stor... | PASS |
------------------------------------------------------------------------------
ISB gsiftp to CE :: Execute a bash shell script.The script is stor... | PASS |
------------------------------------------------------------------------------
OSB localhost :: Execute /bin/uname -a.Store std out and error str... | PASS |
------------------------------------------------------------------------------
OSB gsiftp BaseDestURI :: Execute /bin/uname -a.Store std out and ... | PASS |
------------------------------------------------------------------------------
OSB gsiftp DestURI :: Execute /bin/uname -a.Store std out and erro... | PASS |
------------------------------------------------------------------------------
Environment :: Execute a bash shell script.The script is stored lo... | PASS |
------------------------------------------------------------------------------
Epilogue :: Execute two bash shell scripts,one for the job and the... | PASS |
------------------------------------------------------------------------------
Prologue :: Execute two bash shell scripts,one for the job and the... | PASS |
------------------------------------------------------------------------------
Explicit Delegation :: Test job submission with explicit delegatio... | PASS |
------------------------------------------------------------------------------
Job Cancel :: Test job cancellation.Two cases are tested:             | PASS |
------------------------------------------------------------------------------
Job List :: Test the job listing cli utility.Store the list of the... | PASS |
------------------------------------------------------------------------------
Job Suspend - Resume :: Submit a job and suspend it.Wait until it'... | PASS |
------------------------------------------------------------------------------
Manually Cancel Job :: Submit a job and then manually cancel it on... | PASS |
------------------------------------------------------------------------------
Verify CE service info :: This test case verifies the output of th... | PASS |
------------------------------------------------------------------------------
Enable - Disable Submission :: This test case tests the proper fun... | PASS |
------------------------------------------------------------------------------
Job Purge :: This test case verifies the proper functionality of t... | PASS |
------------------------------------------------------------------------------
Limiter :: NOTE: This test case is about 25 minutes long!             | PASS |
------------------------------------------------------------------------------
Ban User :: This test case tests if the banning of user works. The... | PASS |
------------------------------------------------------------------------------
Sandbox Staging :: This test case tests the two different Sandbox ... | PASS |
------------------------------------------------------------------------------
Automatic Proxy Purging :: This test case checks the automatic pro... | PASS |
------------------------------------------------------------------------------
Verify Job Status Output :: This test is checking the output of th... | FAIL |
'['https://cert-42.pd.infn.it:8443/CREAM039112575', 'CANCELLED', 'https://cert-42.pd.infn.it:8443/CREAM096873115', 'DONE-OK', 'https://cert-42.pd.infn.it:8443/CREAM096922256', 'DONE-OK', 'https://cert-42.pd.infn.it:8443/CREAM130270327', 'DONE-OK', 'https://cert-42.pd.infn.it:8443/CREAM142219948', 'DONE-OK', 'https://cert-42.pd.infn.it:8443/CREAM144042097', 'CANCELLED', 'https://cert-42.pd.infn.it:8443/CREAM144489913', 'DONE-OK', 'https://cert-42.pd.infn.it:8443/CREAM151509511', 'DONE-OK', 'https://cert-42.pd.infn.it:8443/CREAM216440424', 'DONE-OK', 'https://cert-42.pd.infn.it:8443/CREAM242371973', 'DONE-OK', 'https://cert-42.pd.infn.it:8443/CREAM351372075', 'DONE-OK', 'https://cert-42.pd.infn.it:8443/CREAM371767205', 'DONE-OK', 'https://cert-42.pd.infn.it:8443/CREAM377678364', 'DONE-OK', 'https://cert-42.pd.infn.it:8443/CREAM411128309', 'DONE-OK', 'https://cert-42.pd.infn.it:8443/CREAM514181581', 'DONE-OK', 'https://cert-42.pd.infn.it:8443/CREAM526025806', 'REGISTERED', 'https://cert-42.pd.infn.it:8443/CREAM531337500', 'DONE-OK', 'https://cert-42.pd.infn.it:8443/CREAM546215002', 'DONE-OK', 'https://cert-42.pd.infn.it:8443/CREAM548918653', 'DONE-OK', 'https://cert-42.pd.infn.it:8443/CREAM619094711', 'DONE-OK', 'https://cert-42.pd.infn.it:8443/CREAM627130670', 'DONE-OK', 'https://cert-42.pd.infn.it:8443/CREAM659313536', 'DONE-OK', 'https://cert-42.pd.infn.it:8443/CREAM713806828', 'DONE-OK', 'https://cert-42.pd.infn.it:8443/CREAM759669997', 'DONE-OK', 'https://cert-42.pd.infn.it:8443/CREAM860045672', 'DONE-OK', 'https://cert-42.pd.infn.it:8443/CREAM862460658', 'DONE-OK', 'https://cert-42.pd.infn.it:8443/CREAM885876820', 'DONE-OK']' does not contain 'https://cert-42.pd.infn.it:8443/CREAM694842335'
------------------------------------------------------------------------------
OutputData :: This test case tests the OutputData jdl attribute. T... | PASS |
------------------------------------------------------------------------------
Automatic Job Purge :: This test case is testing the functionality... | PASS |
------------------------------------------------------------------------------
Proxy Renewal :: Submit a job lasting 20 minutes using a proxy val... | PASS |
------------------------------------------------------------------------------
CPU Allocation 1 :: Validate the contents of the batch job submiss... | PASS |
------------------------------------------------------------------------------
CPU Allocation 2 :: Validate the contents of the batch job submiss... | PASS |
------------------------------------------------------------------------------
CPU Allocation 3 :: Validate the contents of the batch job submiss... | PASS |
------------------------------------------------------------------------------
CPU Allocation 4 :: Validate the contents of the batch job submiss... | PASS |
------------------------------------------------------------------------------
CPU Allocation 5 :: Validate the contents of the batch job submiss... | PASS |
------------------------------------------------------------------------------
CPU Allocation 6 :: Validate the contents of the batch job submiss... | PASS |
------------------------------------------------------------------------------
Logging and Bookkeeping :: Check if the logging and bookkeeping se... | PASS |
------------------------------------------------------------------------------
Cream Test Suite :: This is the main testing module,needed for tes... | FAIL |
35 critical tests, 34 passed, 1 failed
35 tests total, 34 passed, 1 failed
==============================================================================
Output:  /home/bertocco/output.xml
Log:     /home/bertocco/log.html
Report:  /home/bertocco/report.html
 

CREAM LSF

Line: 87 to 178
 
META FILEATTACHMENT attachment="task34043_install_config_cream_lsf_sl5.log" attr="" comment="" date="1362479339" name="task34043_install_config_cream_lsf_sl5.log" path="task34043_install_config_cream_lsf_sl5.log" size="12835" user="SaraBertocco" version="1"
META FILEATTACHMENT attachment="task34043_update_cream_pbs_sl6.log" attr="" comment="" date="1362494114" name="task34043_update_cream_pbs_sl6.log" path="task34043_update_cream_pbs_sl6.log" size="33043" user="SaraBertocco" version="1"
META FILEATTACHMENT attachment="task34043_conf_update_cream_pbs_sl6.log" attr="" comment="" date="1362494114" name="task34043_conf_update_cream_pbs_sl6.log" path="task34043_conf_update_cream_pbs_sl6.log" size="15913" user="SaraBertocco" version="1"
Added:
>
>
META FILEATTACHMENT attachment="task34043_functionality_pbs_sl6.log" attr="" comment="" date="1362570755" name="task34043_functionality_pbs_sl6.log" path="task34043_functionality_pbs_sl6.log" size="544905" user="SaraBertocco" version="1"

Revision 32013-03-05 - SaraBertocco

Line: 1 to 1
 
META TOPICPARENT name="EMI2CREAMTask34043"
Deleted:
<
<
 

Testing report: IGIRTC-133

Line: 35 to 33
 

Upgrade Installation

CREAM PBS

Changed:
<
<
    • [[][Update log file]]
    • [[][Configuration log file]]
>
>
 

CREAM LSF

    • [[][Update log file]]
Line: 85 to 83
 

-- SaraBertocco - 2013-03-04

Added:
>
>
 
META FILEATTACHMENT attachment="task34043_install_config_cream_lsf_sl5.log" attr="" comment="" date="1362479339" name="task34043_install_config_cream_lsf_sl5.log" path="task34043_install_config_cream_lsf_sl5.log" size="12835" user="SaraBertocco" version="1"
Added:
>
>
META FILEATTACHMENT attachment="task34043_update_cream_pbs_sl6.log" attr="" comment="" date="1362494114" name="task34043_update_cream_pbs_sl6.log" path="task34043_update_cream_pbs_sl6.log" size="33043" user="SaraBertocco" version="1"
META FILEATTACHMENT attachment="task34043_conf_update_cream_pbs_sl6.log" attr="" comment="" date="1362494114" name="task34043_conf_update_cream_pbs_sl6.log" path="task34043_conf_update_cream_pbs_sl6.log" size="15913" user="SaraBertocco" version="1"

Revision 22013-03-05 - SaraBertocco

Line: 1 to 1
 
META TOPICPARENT name="EMI2CREAMTask34043"
Line: 85 to 85
 

-- SaraBertocco - 2013-03-04 \ No newline at end of file

Added:
>
>
META FILEATTACHMENT attachment="task34043_install_config_cream_lsf_sl5.log" attr="" comment="" date="1362479339" name="task34043_install_config_cream_lsf_sl5.log" path="task34043_install_config_cream_lsf_sl5.log" size="12835" user="SaraBertocco" version="1"

Revision 12013-03-04 - SaraBertocco

Line: 1 to 1
Added:
>
>
META TOPICPARENT name="EMI2CREAMTask34043"

Testing report: IGIRTC-133

Summary

  • Product: CREAM v. 1.15.1
  • Release Task: Task #34043
  • ETICS Subsystem Configuration Name:
  • VCS Tag:
  • EMI Major Release: EMI 3 (Monte Bianco)
  • Platform: SL5 epel
  • Author: Sara Bertocco
  • Testing report: [[][Testing Report file]]
  • Certification report: [[][Certification Report file]]
  • Outcome: "In Certification*

Deployment tests

Clean Installation

CREAM PBS

    • [[][Installation log file]]
    • [[][Configuration log file]]

CREAM LSF

    • [[][Installation log file]]
    • [[][Configuration log file]]

Upgrade Installation

CREAM PBS

    • [[][Update log file]]
    • [[][Configuration log file]]

CREAM LSF

    • [[][Update log file]]
    • [[][Configuration log file]]

Unit Tests

System tests

Functionality tests

CREAM PBS

CREAM LSF

Regression tests

Verification attached bugs for CREAM Torque

Bug # FIXED

Verification attached bugs for CREAM LSF

Bug #97441: CREAM: Unwanted auto-updating of the field "creationTime" on the creamdb database FIXED

Standard conformance tests

Glue 1 Compliance

  • glue-validator -t glue1 -h cert-41.pd.infn.it -p 2170 -b o=grid 
    log

Glue 2 Compliance

Performance and scalability tests

Integration testing

Tests described:

-- SaraBertocco - 2013-03-04

 
This site is powered by the TWiki collaboration platformCopyright © 2008-2019 by the contributing authors. All material on this collaboration platform is the property of the contributing authors.
Ideas, requests, problems regarding TWiki? Send feedback