Difference: EMI2CREAMTask34089SL5 (1 vs. 17)

Revision 172012-12-11 - SaraBertocco

Line: 1 to 1
 
META TOPICPARENT name="TestingCreamDgas"

Testing report (SL5): IGIRTC-120

Line: 989 to 989
 

Glue 2 Compliance

  • glue-validator -t glue2 -h cream-06.pd.infn.it -p 2170 -b o=glue 
    log
Deleted:
<
<

Performance and scalability tests

  • Submission and cancellation with polling (SL5 PBS)
       ./bin/cream-test-monitored-cancel -r 30 -n 1000 -m 50 -C 50 -l log4py.conf -j simple.jdl -R cert-42.pd.infn.it:8443/cream-pbs-cert
       
    log

  • Submission with polling and sandbox transfer (SL5 PBS)
       ./bin/cream-test-monitored-submit -r 30 -n 1000 -m 50 -C 50 -l log4py.conf -j jdl/testsandbox.jdl -R cert-42.pd.infn.it:8443/cream-pbs-cert
      
    log
 

Integration testing

Revision 162012-12-11 - CristinaAiftimiei

Line: 1 to 1
 
META TOPICPARENT name="TestingCreamDgas"

Testing report (SL5): IGIRTC-120

Line: 13 to 13
 
  • EMI Major Release: EMI 2 (Matterhorn)
  • Platform: SL5
  • Author: Sara Bertocco
Changed:
<
<
  • Outcome: "Certificatified*
>
>
  • Outcome: "Certified*
 

Deployment tests

Revision 152012-12-10 - SaraBertocco

Line: 1 to 1
 
META TOPICPARENT name="TestingCreamDgas"

Testing report (SL5): IGIRTC-120

Line: 989 to 989
 

Glue 2 Compliance

  • glue-validator -t glue2 -h cream-06.pd.infn.it -p 2170 -b o=glue 
    log
Added:
>
>

Performance and scalability tests

  • Submission and cancellation with polling (SL5 PBS)
       ./bin/cream-test-monitored-cancel -r 30 -n 1000 -m 50 -C 50 -l log4py.conf -j simple.jdl -R cert-42.pd.infn.it:8443/cream-pbs-cert
       
    log

  • Submission with polling and sandbox transfer (SL5 PBS)
       ./bin/cream-test-monitored-submit -r 30 -n 1000 -m 50 -C 50 -l log4py.conf -j jdl/testsandbox.jdl -R cert-42.pd.infn.it:8443/cream-pbs-cert
      
    log
 

Integration testing

Tests described:

Line: 1025 to 1040
 
META FILEATTACHMENT attachment="regressionPBS.html.log" attr="" comment="" date="1354788981" name="regressionPBS.html.log" path="regressionPBS.html.log" size="424580" user="SaraBertocco" version="1"
META FILEATTACHMENT attachment="glue1_compliance" attr="" comment="" date="1354792519" name="glue1_compliance" path="glue1_compliance" size="6337" user="SaraBertocco" version="1"
META FILEATTACHMENT attachment="glue2_compliance" attr="" comment="" date="1354792534" name="glue2_compliance" path="glue2_compliance" size="20370" user="SaraBertocco" version="1"
Added:
>
>
META FILEATTACHMENT attachment="cream-test-sandbox-transfer-cert-42.log" attr="" comment="" date="1355138833" name="cream-test-sandbox-transfer-cert-42.log" path="cream-test-sandbox-transfer-cert-42.log" size="959857" user="SaraBertocco" version="1"
META FILEATTACHMENT attachment="cream-testsubmit-cancel-cert-42.log" attr="" comment="" date="1355138850" name="cream-testsubmit-cancel-cert-42.log" path="cream-testsubmit-cancel-cert-42.log" size="1598283" user="SaraBertocco" version="1"

Revision 142012-12-07 - CristinaAiftimiei

Line: 1 to 1
 
META TOPICPARENT name="TestingCreamDgas"
Changed:
<
<

Testing report: IGIRTC-120

>
>

Testing report (SL5): IGIRTC-120

 
Line: 8 to 8
 
Changed:
<
<
  • ETICS Subsystem Configuration Name:
  • VCS Tag:
>
>
  • ETICS Subsystem Configuration Name: emi-cream-ce_R_1_14_3_8, emi-lrms-utils_R_2_0_2_3
  • VCS Tag: emi-yaim-cream_R_4_3_1_4, emi-cream-common_R_1_14_1_1, emi-cream_R_1_14_2_1, emi-cemonitor-api-java_R_1_14_0_4, emi-cemonitor_R_1_14_0_4, emi-cream-interface_R_1_14_1_1, emi-cream-es_R_1_14_2_1, emi-cream-utils_R_1_2_2_1, emi-cream-api-java_R_1_14_2_1
 
  • EMI Major Release: EMI 2 (Matterhorn)
Changed:
<
<
  • Platform: SL5 epel
>
>
  • Platform: SL5
 
  • Author: Sara Bertocco
Changed:
<
<
  • Testing report: [[][Testing Report file]]
  • Certification report: [[][Certification Report file]]
  • Outcome: "In Certification*
>
>
  • Outcome: "Certificatified*
 

Deployment tests

Revision 132012-12-06 - SaraBertocco

Line: 1 to 1
 
META TOPICPARENT name="TestingCreamDgas"

Testing report: IGIRTC-120

Line: 43 to 43
 

Unit Tests

Changed:
<
<
>
>
Available here
 

System tests

Line: 224 to 224
 

Regression tests

Verification attached bugs for CREAM Torque

Added:
>
>
Bug #95328 In cluster mode, YAIM does not set GlueCEInfoHostName for CREAMs FIXED
 
Added:
>
>
$ ldapsearch -h cream-06.pd.infn.it -x -p 2170 -b "o=grid" objectclass=GlueCE | grep InfoHostName GlueCEInfoHostName: cream-06.pd.infn.it GlueCEInfoHostName: cream-06.pd.infn.it GlueCEInfoHostName: cream-06.pd.infn.it
 
Added:
>
>
Bug #98707 Wrong warning message form ArgusPEPClient configuration NOT TESTED

Bug #94418 The SIGTERM signal should be issued to all the processes belonging to the job FIXED
### On CE:
# ls -l /tmp/test_bug94418.sh
-rw-r--r-- 1 dteam043 dteam 378 Dec  5 16:14 /tmp/test_bug94418.sh

# cat /tmp/test_bug94418.sh
#!/bin/bash                                                                                

OUTF="/tmp/sdpgu.out"

MYPID=$$

sleep 3600 & PID1=$!

sleep 3600 & PID2=$!
echo "MYPID=${MYPID}, PID1=${PID1}, PID2=${PID2}" > $OUTF
echo "MYPID=${MYPID}, PID1=${PID1}, PID2=${PID2}"
# supposedly this should kill the child processes on SIGTERM.
trap "kill $PID1 $PID2" SIGTERM

wait

### On UI:
$ cat test_bug94418.jdl
[
   Type = "job";
   JobType = "normal";
   VirtualOrganisation = "dteam";
   executable="test_bug94418.sh";
   InputSandbox = {"test_bug94418.sh"};
   InputSandboxBaseURI = "gsiftp://cert-41.pd.infn.it/tmp"
]

$ glite-ce-job-submit -d -r cream-06.pd.infn.it:8443/cream-pbs-cert -a test_bug94418.jdl
2012-12-06 12:48:09,303 DEBUG - Using certificate proxy file [/tmp/x509up_u33337]
2012-12-06 12:48:09,325 DEBUG - VO from certificate=[dteam]
2012-12-06 12:48:09,325 WARN - No configuration file suitable for loading. Using built-in configuration
2012-12-06 12:48:09,325 DEBUG - Logfile is [/tmp/glite_cream_cli_logs/glite-ce-job-submit_CREAM_bertocco_20121206-124809.log]
2012-12-06 12:48:09,326 WARN - VirtualOrganisation specified in the JDL but overrided with [dteam]
2012-12-06 12:48:09,326 DEBUG - Processing file [test_bug94418.sh]...
2012-12-06 12:48:09,326 DEBUG - Inserting mangled InputSandbox in JDL: [{"test_bug94418.sh"}]...
2012-12-06 12:48:09,330 INFO - certUtil::generateUniqueID() - Generated DelegationID: [1342e66bf8ec0b8a20c2e91b51cca5a7a03d7e6c]
2012-12-06 12:48:12,291 DEBUG - Registering to [https://cream-06.pd.infn.it:8443/ce-cream/services/CREAM2] JDL=[ BatchSystem = "pbs"; QueueName = "cert"; executable = "test_bug94418.sh"; Type = "job"; VirtualOrganisation = "dteam"; JobType = "normal"; InputSandbox = { "test_bug94418.sh" }; InputSandboxBaseURI = "gsiftp://cert-41.pd.infn.it/tmp" ] - JDL File=[test_bug94418.jdl]
2012-12-06 12:48:13,050 DEBUG - Will invoke JobStart for JobID [CREAM289344871]
https://cream-06.pd.infn.it:8443/CREAM289344871

$ glite-ce-job-status https://cream-06.pd.infn.it:8443/CREAM289344871

******  JobID=[https://cream-06.pd.infn.it:8443/CREAM289344871]
   Status        = [REALLY-RUNNING]

### On WN:
# cat /tmp/sdpgu.out
MYPID=27223, PID1=27225, PID2=27226

# ps -ef |grep 27223
dteam042 27223 27220  0 12:48 ?        00:00:00 /bin/bash ./test_bug94418.sh
dteam042 27225 27223  0 12:48 ?        00:00:00 sleep 3600
dteam042 27226 27223  0 12:48 ?        00:00:00 sleep 3600
root     27229  6392  0 12:49 pts/0    00:00:00 grep 27223
# ps -ef |grep 27225
dteam042 27225 27223  0 12:48 ?        00:00:00 sleep 3600
root     27231  6392  0 12:49 pts/0    00:00:00 grep 27225
# ps -ef |grep 27226
dteam042 27226 27223  0 12:48 ?        00:00:00 sleep 3600
root     27233  6392  0 12:49 pts/0    00:00:00 grep 27226

### On UI:
$ glite-ce-job-cancel https://cream-06.pd.infn.it:8443/CREAM289344871

Are you sure you want to cancel specified job(s) [y/n]: y

$ glite-ce-job-status https://cream-06.pd.infn.it:8443/CREAM289344871

******  JobID=[https://cream-06.pd.infn.it:8443/CREAM289344871]
   Status        = [CANCELLED]
   ExitCode      = []
   Description   = [Cancelled by user]

### On WN:
# ps -ef |grep 27223
root     27261  6392  0 12:51 pts/0    00:00:00 grep 27223
# ps -ef |grep 27225
root     27263  6392  0 12:51 pts/0    00:00:00 grep 27225
# ps -ef |grep 27226
root     27265  6392  0 12:51 pts/0    00:00:00 grep 27226
 
Changed:
<
<

Verification attached bugs for CREAM LSF

>
>
Bug #97106 CREAM JW - fatal_error: command not found FIXED
### On WN:
# mv /usr/bin/glite-lb-logevent  /usr/bin/glite-lb-logevent.save
 
Added:
>
>
### On UI: $ glite-ce-job-status https://cream-06.pd.infn.it:8443/CREAM821651109

**** JobID=[https://cream-06.pd.infn.it:8443/CREAM821651109] Status = [DONE-FAILED] ExitCode = [W] FailureReason = [Cannot find lb_logevent command; reason=1]

Verification attached bugs for CREAM LSF

 
Bug #97441: CREAM: Unwanted auto-updating of the field "creationTime" on the creamdb database FIXED
Line: 330 to 439
 GlueHostApplicationSoftwareRunTimeEnvironment: SI00MeanPerCPU_870
Added:
>
>
Bug #98707 Wrong warning message form ArgusPEPClient configuration NOT TESTED
 
Bug #95973 Missing Glue capability in GLUE2EntityOtherInfo FIXED
# grep CE_CAPABILITY /opt/nfs_install/jra1_test/cream-48/services/glite-creamce
Line: 342 to 453
 GLUE2EntityOtherInfo: SNMPSupport=yes
Changed:
<
<
Bug # FIXED

Verification of old bugs and bugs 96306 and 96512 attached to the patch

>
>

Verification of old bugs and bugs 96306 and 96512 attached to the patch LSF

 
$ pybot bug_*.html
==============================================================================
Line: 585 to 694
 
Changed:
<
<
Bug #96306 (patch attached) manual verification:
>
>
Bug #96306 (patch attached) manual verification LSF:
 
      # cat /opt/glite/var/info/cream-48.pd.infn.it/dteam/dteam.list
      TESTTAGG 
Deleted:
<
<
# ldapsearch -h cream-36.pd.infn.it -x -p 2170 -b "o=glite" | grep -i TESTTAGG # ldapsearch -h cream-36.pd.infn.it -x -p 2170 -b "o=glite" | grep -i GLUE2ApplicationEnvironmentID # ldapsearch -h cream-36.pd.infn.it -x -p 2170 -b "o=glite" | grep -i GLUE2ApplicationEnvironmentAppName
 
Deleted:
<
<
BUT:
  # /var/lib/bdii/gip/plugin/glite-info-dynamic-software-wrapper |grep -i TESTTAGG
GlueHostApplicationSoftwareRunTimeEnvironment
TESTTAGG The information is not updated
Changed:
<
<
Bug #96306 (old) manual verification:
>
>
Bug #59871 (old) manual verification:
 
      # /var/lib/bdii/gip/plugin/glite-info-dynamic-software-wrapper |grep -i tag
      GlueHostApplicationSoftwareRunTimeEnvironment: tag1
      GlueHostApplicationSoftwareRunTimeEnvironment: tag2
      GlueHostApplicationSoftwareRunTimeEnvironment: tag3
Deleted:
<
<
# ldapsearch -h cream-36.pd.infn.it -x -p 2170 -b "o=glite" | grep GlueHostApplicationSoftwareRunTimeEnvironment
 
Changed:
<
<
The information is not updated
>
>

Verification of old bugs and bugs 96306 and 96512 attached to the patch PBS

$ pybot bug_*.html
==============================================================================
Bug 59871 & Bug 69857 & Bug 81561 & Bug 83238 & Bug 83338 & Bug 83592 & Bug...
==============================================================================
 batch_system = pbs
 ce_admin_user = root
 ce_admin_pass = cmsgrid
 ce_host = cream-06.pd.infn.it
 ce_endpoint = cream-06.pd.infn.it:8443
 cream_queue = cream-pbs-cert
 vo = dteam
 proxy_pass = sarabINFN
 log_level = TRACE
 tmp_dir = /tmp
 delete_files = False
 tomcat_service = tomcat5
 catalina_home = /var/lib/tomcat5
middleware_version = emi2
 ce_cream_xml = /etc/glite-ce-cream/cream-config.xml
 cream_config_xml = /etc/glite-ce-cream/cream-config.xml
 blah_config = /etc/blah.config
 site_info = /root/siteinfo/site-info_1.def
 services_glite_creamce = /root/siteinfo/services/glite-creamce
 blah_bupdater_loop_interval = bupdater_loop_interval
 blah_check_children_interval = blah_check_children_interval
 blah_bupdater_use_bhist_for_killed = bupdater_use_bhist_for_killed
 cream_sandbox_path = CREAM_SANDBOX_PATH
 cream_concurrency_level_yaim_name = CREAM_CONCURRENCY_LEVEL
 middleware_version = emi2
 cream_concurrency_level = commandworkerpoolsize
 ce = cream-06.pd.infn.it:8443/cream-pbs-cert
Command "/usr/bin/voms-proxy-info" output follows:
subject   : /C=IT/O=INFN/OU=Personal Certificate/L=Padova/CN=Sara Bertocco/CN=proxy
issuer    : /C=IT/O=INFN/OU=Personal Certificate/L=Padova/CN=Sara Bertocco
identity  : /C=IT/O=INFN/OU=Personal Certificate/L=Padova/CN=Sara Bertocco
type      : proxy
strength  : 1024 bits
path      : /tmp/x509up_u33337
timeleft  : 11:48:51

Command's output printed.
 dn = /C=IT/O=INFN/OU=Personal Certificate/L=Padova/CN=Sara Bertocco/CN=proxy
The files of this testsuite will be stored under: /tmp/tmplStRTT.cream_testing/
Bug 59871 & Bug 69857 & Bug 81561 & Bug 83238 & Bug 83338 & Bug 83592 & Bug...
==============================================================================
Set Log Level :: Set the log level used for the test suite. This c... | PASS |
------------------------------------------------------------------------------
bug_59871                                                             | PASS |
------------------------------------------------------------------------------
Teardown                                                              | PASS |
------------------------------------------------------------------------------
Bug 59871 & Bug 69857 & Bug 81561 & Bug 83238 & Bug 83338 & Bug 83... | PASS |
3 critical tests, 3 passed, 0 failed
3 tests total, 3 passed, 0 failed
==============================================================================
Bug 59871 & Bug 69857 & Bug 81561 & Bug 83238 & Bug 83338 & Bug 83592 & Bug...
==============================================================================
Set Log Level :: Set the log level used for the test suite. This c... | PASS |
------------------------------------------------------------------------------
Check Executables :: Check whether the needed executables for the ... | PASS |
------------------------------------------------------------------------------
bug_69857                                                             | PASS |
------------------------------------------------------------------------------
Bug 59871 & Bug 69857 & Bug 81561 & Bug 83238 & Bug 83338 & Bug 83... | PASS |
3 critical tests, 3 passed, 0 failed
3 tests total, 3 passed, 0 failed
==============================================================================
Bug 59871 & Bug 69857 & Bug 81561 & Bug 83238 & Bug 83338 & Bug 83592 & Bug...
==============================================================================
Set Log Level :: Set the log level used for the test suite. This c... | PASS |
------------------------------------------------------------------------------
bug_81561                                                             | PASS |
------------------------------------------------------------------------------
Bug 59871 & Bug 69857 & Bug 81561 & Bug 83238 & Bug 83338 & Bug 83... | PASS |
2 critical tests, 2 passed, 0 failed
2 tests total, 2 passed, 0 failed
==============================================================================
Bug 59871 & Bug 69857 & Bug 81561 & Bug 83238 & Bug 83338 & Bug 83592 & Bug...
==============================================================================
Set Log Level :: Set the log level used for the test suite. This c... | PASS |
------------------------------------------------------------------------------
Check Executables :: Check whether the needed executables for the ... | PASS |
------------------------------------------------------------------------------
bug_83238                                                             | PASS |
------------------------------------------------------------------------------
Bug 59871 & Bug 69857 & Bug 81561 & Bug 83238 & Bug 83338 & Bug 83... | PASS |
3 critical tests, 3 passed, 0 failed
3 tests total, 3 passed, 0 failed
==============================================================================
Bug 59871 & Bug 69857 & Bug 81561 & Bug 83238 & Bug 83338 & Bug 83592 & Bug...
==============================================================================
Set Log Level :: Set the log level used for the test suite. This c... | PASS |
------------------------------------------------------------------------------
Check Executables :: Check whether the needed executables for the ... | PASS |
------------------------------------------------------------------------------
bug_83338                                                             | PASS |
------------------------------------------------------------------------------
Bug 59871 & Bug 69857 & Bug 81561 & Bug 83238 & Bug 83338 & Bug 83... | PASS |
3 critical tests, 3 passed, 0 failed
3 tests total, 3 passed, 0 failed
==============================================================================
Bug 59871 & Bug 69857 & Bug 81561 & Bug 83238 & Bug 83338 & Bug 83592 & Bug...
==============================================================================
Set Log Level :: Set the log level used for the test suite. This c... | PASS |
------------------------------------------------------------------------------
Check Executables :: Check whether the needed executables for the ... | PASS |
------------------------------------------------------------------------------
bug_83592                                                             | PASS |
------------------------------------------------------------------------------
Bug 59871 & Bug 69857 & Bug 81561 & Bug 83238 & Bug 83338 & Bug 83... | PASS |
3 critical tests, 3 passed, 0 failed
3 tests total, 3 passed, 0 failed
==============================================================================
Bug 59871 & Bug 69857 & Bug 81561 & Bug 83238 & Bug 83338 & Bug 83592 & Bug...
==============================================================================
Set Log Level :: Set the log level used for the test suite. This c... | PASS |
------------------------------------------------------------------------------
Check Executables :: Check whether the needed executables for the ... | PASS |
------------------------------------------------------------------------------
bug_83593                                                             | PASS |
------------------------------------------------------------------------------
Bug 59871 & Bug 69857 & Bug 81561 & Bug 83238 & Bug 83338 & Bug 83... | PASS |
3 critical tests, 3 passed, 0 failed
3 tests total, 3 passed, 0 failed
==============================================================================
Bug 59871 & Bug 69857 & Bug 81561 & Bug 83238 & Bug 83338 & Bug 83592 & Bug...
==============================================================================
bug_83749                                                             | PASS |
------------------------------------------------------------------------------
Bug 59871 & Bug 69857 & Bug 81561 & Bug 83238 & Bug 83338 & Bug 83... | PASS |
1 critical test, 1 passed, 0 failed
1 test total, 1 passed, 0 failed
==============================================================================
Bug 59871 & Bug 69857 & Bug 81561 & Bug 83238 & Bug 83338 & Bug 83592 & Bug...
==============================================================================
Set Log Level :: Set the log level used for the test suite. This c... | PASS |
------------------------------------------------------------------------------
bug_84374                                                             | FAIL |
CHECK FAILED != CHECK SUCCESSFUL
------------------------------------------------------------------------------
Bug 59871 & Bug 69857 & Bug 81561 & Bug 83238 & Bug 83338 & Bug 83... | FAIL |
2 critical tests, 1 passed, 1 failed
2 tests total, 1 passed, 1 failed
==============================================================================
Bug 59871 & Bug 69857 & Bug 81561 & Bug 83238 & Bug 83338 & Bug 83592 & Bug...
==============================================================================
Set Log Level :: Set the log level used for the test suite. This c... | PASS |
------------------------------------------------------------------------------
bug_86191                                                             | FAIL |
None != CHECK SUCCESSFUL
------------------------------------------------------------------------------
Bug 59871 & Bug 69857 & Bug 81561 & Bug 83238 & Bug 83338 & Bug 83... | FAIL |
2 critical tests, 1 passed, 1 failed
2 tests total, 1 passed, 1 failed
==============================================================================
Bug 59871 & Bug 69857 & Bug 81561 & Bug 83238 & Bug 83338 & Bug 83592 & Bug...
==============================================================================
Set Log Level :: Set the log level used for the test suite. This c... | PASS |
------------------------------------------------------------------------------
bug_87361                                                             | PASS |
------------------------------------------------------------------------------
Bug 59871 & Bug 69857 & Bug 81561 & Bug 83238 & Bug 83338 & Bug 83... | PASS |
2 critical tests, 2 passed, 0 failed
2 tests total, 2 passed, 0 failed
==============================================================================
Bug 59871 & Bug 69857 & Bug 81561 & Bug 83238 & Bug 83338 & Bug 83592 & Bug...
==============================================================================
Set Log Level :: Set the log level used for the test suite. This c... | PASS |
------------------------------------------------------------------------------
bug_87492                                                             | PASS |
------------------------------------------------------------------------------
Bug 59871 & Bug 69857 & Bug 81561 & Bug 83238 & Bug 83338 & Bug 83... | PASS |
2 critical tests, 2 passed, 0 failed
2 tests total, 2 passed, 0 failed
==============================================================================
Bug 59871 & Bug 69857 & Bug 81561 & Bug 83238 & Bug 83338 & Bug 83592 & Bug...
==============================================================================
Set Log Level :: Set the log level used for the test suite. This c... | PASS |
------------------------------------------------------------------------------
bug_89489                                                             | PASS |
------------------------------------------------------------------------------
Bug 59871 & Bug 69857 & Bug 81561 & Bug 83238 & Bug 83338 & Bug 83... | PASS |
2 critical tests, 2 passed, 0 failed
2 tests total, 2 passed, 0 failed
==============================================================================
Bug 59871 & Bug 69857 & Bug 81561 & Bug 83238 & Bug 83338 & Bug 83592 & Bug...
==============================================================================
Set Log Level :: Set the log level used for the test suite. This c... | PASS |
------------------------------------------------------------------------------
bug_95356                                                             | PASS |
------------------------------------------------------------------------------
Bug 59871 & Bug 69857 & Bug 81561 & Bug 83238 & Bug 83338 & Bug 83... | PASS |
2 critical tests, 2 passed, 0 failed
2 tests total, 2 passed, 0 failed
==============================================================================
Bug 59871 & Bug 69857 & Bug 81561 & Bug 83238 & Bug 83338 & Bug 83592 & Bug...
==============================================================================
Set Log Level :: Set the log level used for the test suite. This c... | PASS |
------------------------------------------------------------------------------
Check Executables :: Check whether the needed executables for the ... | PASS |
------------------------------------------------------------------------------
bug_95552                                                             | PASS |
------------------------------------------------------------------------------
Bug 59871 & Bug 69857 & Bug 81561 & Bug 83238 & Bug 83338 & Bug 83... | PASS |
3 critical tests, 3 passed, 0 failed
3 tests total, 3 passed, 0 failed
==============================================================================
Bug 59871 & Bug 69857 & Bug 81561 & Bug 83238 & Bug 83338 & Bug 83592 & Bug...
==============================================================================
Set Log Level :: Set the log level used for the test suite. This c... | PASS |
------------------------------------------------------------------------------
bug_96306                                                             | PASS |
------------------------------------------------------------------------------
Teardown                                                              | PASS |
------------------------------------------------------------------------------
Bug 59871 & Bug 69857 & Bug 81561 & Bug 83238 & Bug 83338 & Bug 83... | PASS |
3 critical tests, 3 passed, 0 failed
3 tests total, 3 passed, 0 failed
==============================================================================
Bug 59871 & Bug 69857 & Bug 81561 & Bug 83238 & Bug 83338 & Bug 83592 & Bug...
==============================================================================
Set Log Level :: Set the log level used for the test suite. This c... | PASS |
------------------------------------------------------------------------------
bug_96512                                                             | PASS |
------------------------------------------------------------------------------
Bug 59871 & Bug 69857 & Bug 81561 & Bug 83238 & Bug 83338 & Bug 83... | PASS |
2 critical tests, 2 passed, 0 failed
2 tests total, 2 passed, 0 failed
==============================================================================
Bug 59871 & Bug 69857 & Bug 81561 & Bug 83238 & Bug 83338 & Bug 83... | FAIL |
41 critical tests, 39 passed, 2 failed
41 tests total, 39 passed, 2 failed
==============================================================================
Output:  /home/bertocco/cream_blah_testsuites-master/cream_regression_testsuite/tests/output.xml
Log:     /home/bertocco/cream_blah_testsuites-master/cream_regression_testsuite/tests/log.html
Report:  /home/bertocco/cream_blah_testsuites-master/cream_regression_testsuite/tests/report.html

Separeted verification of failed bugs:

==============================================================================
Bug 84374 :: Regression test of Bug #84374 yaim-cream-ce: GlueForeignKey: G...
==============================================================================
Set Log Level :: Set the log level used for the test suite. This c... | PASS |
------------------------------------------------------------------------------
bug_84374                                                             | PASS |
------------------------------------------------------------------------------
Bug 84374 :: Regression test of Bug #84374 yaim-cream-ce: GlueFore... | PASS |
2 critical tests, 2 passed, 0 failed
2 tests total, 2 passed, 0 failed
==============================================================================

==============================================================================
Bug 86191 :: Regression test of Bug #86191 No info published by the lcg-inf...
==============================================================================
Set Log Level :: Set the log level used for the test suite. This c... | PASS |
------------------------------------------------------------------------------
bug_86191                                                             | PASS |
------------------------------------------------------------------------------
Bug 86191 :: Regression test of Bug #86191 No info published by th... | PASS |
2 critical tests, 2 passed, 0 failed
2 tests total, 2 passed, 0 failed
==============================================================================

Standard conformance tests

Glue 1 Compliance

  • glue-validator -t glue1 -h cream-06.pd.infn.it -p 2170 -b o=grid 
    log

Glue 2 Compliance

  • glue-validator -t glue2 -h cream-06.pd.infn.it -p 2170 -b o=glue 
    log
 

Integration testing

Added:
>
>
Tests described:

 
Line: 627 to 1022
 
META FILEATTACHMENT attachment="CREAM_SL5_LSF_update_yum.log" attr="" comment="" date="1354782077" name="CREAM_SL5_LSF_update_yum.log" path="CREAM_SL5_LSF_update_yum.log" size="9304" user="SergioTraldi" version="1"
META FILEATTACHMENT attachment="CREAM_SL5_PBS_update_yaim.log" attr="" comment="" date="1354782077" name="CREAM_SL5_PBS_update_yaim.log" path="CREAM_SL5_PBS_update_yaim.log" size="14970" user="SergioTraldi" version="1"
META FILEATTACHMENT attachment="CREAM_SL5_PBS_update_yum.log" attr="" comment="" date="1354782077" name="CREAM_SL5_PBS_update_yum.log" path="CREAM_SL5_PBS_update_yum.log" size="10398" user="SergioTraldi" version="1"
Added:
>
>
META FILEATTACHMENT attachment="bug_84374.html.log" attr="" comment="" date="1354789013" name="bug_84374.html.log" path="bug_84374.html.log" size="168256" user="SaraBertocco" version="1"
META FILEATTACHMENT attachment="bug_86191.html.log" attr="" comment="" date="1354786181" name="bug_86191.html.log" path="bug_86191.html.log" size="168146" user="SaraBertocco" version="1"
META FILEATTACHMENT attachment="regressionPBS.html.log" attr="" comment="" date="1354788981" name="regressionPBS.html.log" path="regressionPBS.html.log" size="424580" user="SaraBertocco" version="1"
META FILEATTACHMENT attachment="glue1_compliance" attr="" comment="" date="1354792519" name="glue1_compliance" path="glue1_compliance" size="6337" user="SaraBertocco" version="1"
META FILEATTACHMENT attachment="glue2_compliance" attr="" comment="" date="1354792534" name="glue2_compliance" path="glue2_compliance" size="20370" user="SaraBertocco" version="1"

Revision 122012-12-06 - SergioTraldi

Line: 1 to 1
 
META TOPICPARENT name="TestingCreamDgas"

Testing report: IGIRTC-120

Line: 34 to 34
 

Upgrade Installation

CREAM PBS

Changed:
<
<
  • [[][Update log file]]
  • [[][Configuration log file]]
>
>
 

CREAM LSF

Changed:
<
<
>
>
 

Unit Tests

Line: 623 to 623
 
META FILEATTACHMENT attachment="regressionLSF.html.log" attr="" comment="" date="1354715478" name="regressionLSF.html.log" path="regressionLSF.html.log" size="301622" user="SaraBertocco" version="1"
META FILEATTACHMENT attachment="functionalityPBS.html.log" attr="" comment="" date="1354723981" name="functionalityPBS.html.log" path="functionalityPBS.html.log" size="442496" user="SaraBertocco" version="1"
META FILEATTACHMENT attachment="outputdata.html.log" attr="" comment="" date="1354729268" name="outputdata.html.log" path="outputdata.html.log" size="177428" user="SaraBertocco" version="1"
Added:
>
>
META FILEATTACHMENT attachment="CREAM_SL5_LSF_update_yaim.log" attr="" comment="" date="1354782077" name="CREAM_SL5_LSF_update_yaim.log" path="CREAM_SL5_LSF_update_yaim.log" size="46545" user="SergioTraldi" version="1"
META FILEATTACHMENT attachment="CREAM_SL5_LSF_update_yum.log" attr="" comment="" date="1354782077" name="CREAM_SL5_LSF_update_yum.log" path="CREAM_SL5_LSF_update_yum.log" size="9304" user="SergioTraldi" version="1"
META FILEATTACHMENT attachment="CREAM_SL5_PBS_update_yaim.log" attr="" comment="" date="1354782077" name="CREAM_SL5_PBS_update_yaim.log" path="CREAM_SL5_PBS_update_yaim.log" size="14970" user="SergioTraldi" version="1"
META FILEATTACHMENT attachment="CREAM_SL5_PBS_update_yum.log" attr="" comment="" date="1354782077" name="CREAM_SL5_PBS_update_yum.log" path="CREAM_SL5_PBS_update_yum.log" size="10398" user="SergioTraldi" version="1"

Revision 112012-12-05 - SaraBertocco

Line: 1 to 1
 
META TOPICPARENT name="TestingCreamDgas"

Testing report: IGIRTC-120

Line: 124 to 124
 

Added:
>
>
The OutputData test failed for a configuration problem (LCG_GFAL_INFOSYS was not set in the worker node). Fixing the problem:
$ pybot -i outputdata /opt/cream_test/testsuite/cream_test_suite.html
INFO: The files of this testsuite will be stored under: /tmp/tmplOrH9L.cream_testing/
INFO: Non-mandatory variable "sec_cert" has not been set.
INFO: Non-mandatory variable "sec_key" has not been set.
INFO: Non-mandatory variable "argus_host" has not been set.
INFO: Non-mandatory variable "sec_proxy_pass" has not been set.
INFO: Non-mandatory variable "argus_root_pass" has not been set.
==============================================================================
Cream Test Suite :: This is the main testing module,needed for testing the ...
==============================================================================
OutputData :: This test case tests the OutputData jdl attribute. T... | PASS |
------------------------------------------------------------------------------
Cream Test Suite :: This is the main testing module,needed for tes... | PASS |
1 critical test, 1 passed, 0 failed
1 test total, 1 passed, 0 failed
==============================================================================
Output:  /home/bertocco/output.xml
Log:     /home/bertocco/log.html
Report:  /home/bertocco/report.html
 

CREAM LSF

$ pybot -e job_man -e cpu_alloc -e glue -e ban -e bdii -e lb -e old_blah -e status /opt/cream_test/testsuite/cream_test_suite.html
Line: 598 to 622
 
META FILEATTACHMENT attachment="functionalityLSF.html.log" attr="" comment="" date="1354699088" name="functionalityLSF.html.log" path="functionalityLSF.html.log" size="453402" user="SaraBertocco" version="1"
META FILEATTACHMENT attachment="regressionLSF.html.log" attr="" comment="" date="1354715478" name="regressionLSF.html.log" path="regressionLSF.html.log" size="301622" user="SaraBertocco" version="1"
META FILEATTACHMENT attachment="functionalityPBS.html.log" attr="" comment="" date="1354723981" name="functionalityPBS.html.log" path="functionalityPBS.html.log" size="442496" user="SaraBertocco" version="1"
Added:
>
>
META FILEATTACHMENT attachment="outputdata.html.log" attr="" comment="" date="1354729268" name="outputdata.html.log" path="outputdata.html.log" size="177428" user="SaraBertocco" version="1"

Revision 102012-12-05 - SaraBertocco

Line: 1 to 1
 
META TOPICPARENT name="TestingCreamDgas"

Testing report: IGIRTC-120

Line: 50 to 50
 

Functionality tests

CREAM PBS

Added:
>
>
$ pybot -e job_man -e cpu_alloc -e glue -e ban -e bdii -e lb -e old_blah -e status /opt/cream_test/testsuite/cream_test_suite.html
INFO: The files of this testsuite will be stored under: /tmp/tmpi7FLa2.cream_testing/
INFO: Non-mandatory variable "sec_cert" has not been set.
INFO: Non-mandatory variable "sec_key" has not been set.
INFO: Non-mandatory variable "argus_host" has not been set.
INFO: Non-mandatory variable "sec_proxy_pass" has not been set.
INFO: Non-mandatory variable "argus_root_pass" has not been set.
==============================================================================
Cream Test Suite :: This is the main testing module,needed for testing the ...
==============================================================================
Set Log Level :: Set the log level used for the test suite. This c... | PASS |
------------------------------------------------------------------------------
Check Executables :: Check whether the needed executables for the ... | PASS |
------------------------------------------------------------------------------
Simple Submit :: Execute /bin/uname -a.Submit the jdl and wait for... | PASS |
------------------------------------------------------------------------------
ISB Base URI :: Execute a bash shell script.The script is stored i... | PASS |
------------------------------------------------------------------------------
ISB Client to CE :: Execute a bash shell script.The script is stor... | PASS |
------------------------------------------------------------------------------
ISB gsiftp to CE :: Execute a bash shell script.The script is stor... | PASS |
------------------------------------------------------------------------------
OSB localhost :: Execute /bin/uname -a.Store std out and error str... | PASS |
------------------------------------------------------------------------------
OSB gsiftp BaseDestURI :: Execute /bin/uname -a.Store std out and ... | PASS |
------------------------------------------------------------------------------
OSB gsiftp DestURI :: Execute /bin/uname -a.Store std out and erro... | PASS |
------------------------------------------------------------------------------
Environment :: Execute a bash shell script.The script is stored lo... | PASS |
------------------------------------------------------------------------------
Epilogue :: Execute two bash shell scripts,one for the job and the... | PASS |
------------------------------------------------------------------------------
Prologue :: Execute two bash shell scripts,one for the job and the... | PASS |
------------------------------------------------------------------------------
Explicit Delegation :: Test job submission with explicit delegatio... | PASS |
------------------------------------------------------------------------------
Job Cancel :: Test job cancellation.Two cases are tested:             | PASS |
------------------------------------------------------------------------------
Job List :: Test the job listing cli utility.Store the list of the... | PASS |
------------------------------------------------------------------------------
Job Suspend - Resume :: Submit a job and suspend it.Wait until it'... | PASS |
------------------------------------------------------------------------------
Manually Cancel Job :: Submit a job and then manually cancel it on... | PASS |
------------------------------------------------------------------------------
Verify CE service info :: This test case verifies the output of th... | PASS |
------------------------------------------------------------------------------
Enable - Disable Submission :: This test case tests the proper fun... | PASS |
------------------------------------------------------------------------------
Job Purge :: This test case verifies the proper functionality of t... | PASS |
------------------------------------------------------------------------------
Limiter :: NOTE: This test case is about 25 minutes long!             | PASS |
------------------------------------------------------------------------------
Sandbox Staging :: This test case tests the two different Sandbox ... | PASS |
------------------------------------------------------------------------------
Automatic Proxy Purging :: This test case checks the automatic pro... | PASS |
------------------------------------------------------------------------------
OutputData :: This test case tests the OutputData jdl attribute. T... | FAIL |
'[]' should not be empty
------------------------------------------------------------------------------
Automatic Job Purge :: This test case is testing the functionality... | PASS |
------------------------------------------------------------------------------
Proxy Renewal :: Submit a job lasting 20 minutes using a proxy val... | PASS |
------------------------------------------------------------------------------
Cream Test Suite :: This is the main testing module,needed for tes... | FAIL |
26 critical tests, 25 passed, 1 failed
26 tests total, 25 passed, 1 failed
==============================================================================
Output:  /home/bertocco/output.xml
Log:     /home/bertocco/log.html
Report:  /home/bertocco/report.html
 

CREAM LSF

Line: 524 to 597
 
META FILEATTACHMENT attachment="CREAM_SL5_PBS_install_yaim.log" attr="" comment="" date="1354642425" name="CREAM_SL5_PBS_install_yaim.log" path="CREAM_SL5_PBS_install_yaim.log" size="5248" user="SaraBertocco" version="1"
META FILEATTACHMENT attachment="functionalityLSF.html.log" attr="" comment="" date="1354699088" name="functionalityLSF.html.log" path="functionalityLSF.html.log" size="453402" user="SaraBertocco" version="1"
META FILEATTACHMENT attachment="regressionLSF.html.log" attr="" comment="" date="1354715478" name="regressionLSF.html.log" path="regressionLSF.html.log" size="301622" user="SaraBertocco" version="1"
Added:
>
>
META FILEATTACHMENT attachment="functionalityPBS.html.log" attr="" comment="" date="1354723981" name="functionalityPBS.html.log" path="functionalityPBS.html.log" size="442496" user="SaraBertocco" version="1"

Revision 92012-12-05 - SaraBertocco

Line: 1 to 1
 
META TOPICPARENT name="TestingCreamDgas"

Testing report: IGIRTC-120

Line: 129 to 129
 

Verification attached bugs for CREAM Torque

Changed:
<
<
>
>
 

Verification attached bugs for CREAM LSF

Changed:
<
<
>
>
 
Bug #97441: CREAM: Unwanted auto-updating of the field "creationTime" on the creamdb database FIXED
Line: 203 to 204
 GlueHostApplicationSoftwareRunTimeEnvironment: LCG GlueHostApplicationSoftwareRunTimeEnvironment: MPIch GlueHostApplicationSoftwareRunTimeEnvironment: RMON3.1
Added:
>
>
# /var/lib/bdii/gip/plugin/glite-info-dynamic-software-wrapper |grep -i RMON GlueHostApplicationSoftwareRunTimeEnvironment: RMON3.1

# /var/lib/bdii/gip/plugin/glite-info-dynamic-software-wrapper |grep -i RMon GlueHostApplicationSoftwareRunTimeEnvironment: RMON3.1

# /var/lib/bdii/gip/plugin/glite-info-dynamic-software-wrapper |grep GlueHostApplicationSoftwareRunTimeEnvironment GlueHostApplicationSoftwareRunTimeEnvironment: GLITE-3_0_0 GlueHostApplicationSoftwareRunTimeEnvironment: GLITE-3_1_0 GlueHostApplicationSoftwareRunTimeEnvironment: LCG-2 GlueHostApplicationSoftwareRunTimeEnvironment: LCG-2_1_0 GlueHostApplicationSoftwareRunTimeEnvironment: LCG-2_1_1 GlueHostApplicationSoftwareRunTimeEnvironment: LCG-2_2_0 GlueHostApplicationSoftwareRunTimeEnvironment: LCG-2_3_0 GlueHostApplicationSoftwareRunTimeEnvironment: LCG-2_3_1 GlueHostApplicationSoftwareRunTimeEnvironment: LCG-2_4_0 GlueHostApplicationSoftwareRunTimeEnvironment: LCG-2_5_0 GlueHostApplicationSoftwareRunTimeEnvironment: LCG-2_6_0 GlueHostApplicationSoftwareRunTimeEnvironment: LCG-2_7_0 GlueHostApplicationSoftwareRunTimeEnvironment: MPICH GlueHostApplicationSoftwareRunTimeEnvironment: MPI_HOME_NOTSHARED GlueHostApplicationSoftwareRunTimeEnvironment: PADOVA GlueHostApplicationSoftwareRunTimeEnvironment: R-GMA GlueHostApplicationSoftwareRunTimeEnvironment: RMON3.1 GlueHostApplicationSoftwareRunTimeEnvironment: SF00MeanPerCPU_790 GlueHostApplicationSoftwareRunTimeEnvironment: SI00MeanPerCPU_870

 

Bug #95973 Missing Glue capability in GLUE2EntityOtherInfo FIXED
Line: 218 to 246
 

Bug # FIXED
Added:
>
>

Verification of old bugs and bugs 96306 and 96512 attached to the patch

$ pybot bug_*.html
==============================================================================
Bug 59871 & Bug 69857 & Bug 81561 & Bug 83238 & Bug 83338 & Bug 83592 & Bug...
==============================================================================
 batch_system = lsf
 ce_admin_user = root
 ce_admin_pass = cmsgrid
 ce_host = cream-48.pd.infn.it
 ce_endpoint = cream-48.pd.infn.it:8443
 cream_queue = cream-lsf-cert
 vo = dteam
 proxy_pass = sarabINFN
 log_level = TRACE
 tmp_dir = /tmp
 delete_files = False
 tomcat_service = tomcat5
 catalina_home = /var/lib/tomcat5
middleware_version = emi2
 ce_cream_xml = /etc/glite-ce-cream/cream-config.xml
 cream_config_xml = /etc/glite-ce-cream/cream-config.xml
 blah_config = /etc/blah.config
 site_info = /root/siteinfo/site-info_lsf.def
 services_glite_creamce = /root/siteinfo/services/glite-creamce
 blah_bupdater_loop_interval = bupdater_loop_interval
 blah_check_children_interval = blah_check_children_interval
 blah_bupdater_use_bhist_for_killed = bupdater_use_bhist_for_killed
 cream_sandbox_path = CREAM_SANDBOX_PATH
 cream_concurrency_level_yaim_name = CREAM_CONCURRENCY_LEVEL
 middleware_version = emi2
 cream_concurrency_level = commandworkerpoolsize
 ce = cream-48.pd.infn.it:8443/cream-lsf-cert
Command "/usr/bin/voms-proxy-info" output follows:
subject   : /C=IT/O=INFN/OU=Personal Certificate/L=Padova/CN=Sara Bertocco/CN=proxy
issuer    : /C=IT/O=INFN/OU=Personal Certificate/L=Padova/CN=Sara Bertocco
identity  : /C=IT/O=INFN/OU=Personal Certificate/L=Padova/CN=Sara Bertocco
type      : proxy
strength  : 1024 bits
path      : /tmp/x509up_u33337
timeleft  : 11:57:26

Command's output printed.
 dn = /C=IT/O=INFN/OU=Personal Certificate/L=Padova/CN=Sara Bertocco/CN=proxy
The files of this testsuite will be stored under: /tmp/tmpiEYKea.cream_testing/
Bug 59871 & Bug 69857 & Bug 81561 & Bug 83238 & Bug 83338 & Bug 83592 & Bug...
==============================================================================
Set Log Level :: Set the log level used for the test suite. This c... | PASS |
------------------------------------------------------------------------------
bug_59871                                                             | FAIL |
_error: 'ldapsearch -h cream-48.pd.infn.it -x -p 2170 -b mds-vo-name=resource,o=grid | grep -i GlueHostApplicationSoftwareRunTimeEnvironment'Failed: output empty
------------------------------------------------------------------------------
Teardown                                                              | PASS |
------------------------------------------------------------------------------
Bug 59871 & Bug 69857 & Bug 81561 & Bug 83238 & Bug 83338 & Bug 83... | FAIL |
3 critical tests, 2 passed, 1 failed
3 tests total, 2 passed, 1 failed
==============================================================================
Bug 59871 & Bug 69857 & Bug 81561 & Bug 83238 & Bug 83338 & Bug 83592 & Bug...
==============================================================================
Set Log Level :: Set the log level used for the test suite. This c... | PASS |
------------------------------------------------------------------------------
Check Executables :: Check whether the needed executables for the ... | PASS |
------------------------------------------------------------------------------
bug_69857                                                             | PASS |
------------------------------------------------------------------------------
Bug 59871 & Bug 69857 & Bug 81561 & Bug 83238 & Bug 83338 & Bug 83... | PASS |
3 critical tests, 3 passed, 0 failed
3 tests total, 3 passed, 0 failed
==============================================================================
Bug 59871 & Bug 69857 & Bug 81561 & Bug 83238 & Bug 83338 & Bug 83592 & Bug...
==============================================================================
Set Log Level :: Set the log level used for the test suite. This c... | PASS |
------------------------------------------------------------------------------
bug_81561                                                             | PASS |
------------------------------------------------------------------------------
Bug 59871 & Bug 69857 & Bug 81561 & Bug 83238 & Bug 83338 & Bug 83... | PASS |
2 critical tests, 2 passed, 0 failed
2 tests total, 2 passed, 0 failed
==============================================================================
Bug 59871 & Bug 69857 & Bug 81561 & Bug 83238 & Bug 83338 & Bug 83592 & Bug...
==============================================================================
Set Log Level :: Set the log level used for the test suite. This c... | PASS |
------------------------------------------------------------------------------
Check Executables :: Check whether the needed executables for the ... | PASS |
------------------------------------------------------------------------------
bug_83238                                                             | PASS |
------------------------------------------------------------------------------
Bug 59871 & Bug 69857 & Bug 81561 & Bug 83238 & Bug 83338 & Bug 83... | PASS |
3 critical tests, 3 passed, 0 failed
3 tests total, 3 passed, 0 failed
==============================================================================
Bug 59871 & Bug 69857 & Bug 81561 & Bug 83238 & Bug 83338 & Bug 83592 & Bug...
==============================================================================
Set Log Level :: Set the log level used for the test suite. This c... | PASS |
------------------------------------------------------------------------------
Check Executables :: Check whether the needed executables for the ... | PASS |
------------------------------------------------------------------------------
bug_83338                                                             | PASS |
------------------------------------------------------------------------------
Bug 59871 & Bug 69857 & Bug 81561 & Bug 83238 & Bug 83338 & Bug 83... | PASS |
3 critical tests, 3 passed, 0 failed
3 tests total, 3 passed, 0 failed
==============================================================================
Bug 59871 & Bug 69857 & Bug 81561 & Bug 83238 & Bug 83338 & Bug 83592 & Bug...
==============================================================================
Set Log Level :: Set the log level used for the test suite. This c... | PASS |
------------------------------------------------------------------------------
Check Executables :: Check whether the needed executables for the ... | PASS |
------------------------------------------------------------------------------
bug_83592                                                             | PASS |
------------------------------------------------------------------------------
Bug 59871 & Bug 69857 & Bug 81561 & Bug 83238 & Bug 83338 & Bug 83... | PASS |
3 critical tests, 3 passed, 0 failed
3 tests total, 3 passed, 0 failed
==============================================================================
Bug 59871 & Bug 69857 & Bug 81561 & Bug 83238 & Bug 83338 & Bug 83592 & Bug...
==============================================================================
Set Log Level :: Set the log level used for the test suite. This c... | PASS |
------------------------------------------------------------------------------
Check Executables :: Check whether the needed executables for the ... | PASS |
------------------------------------------------------------------------------
bug_83593                                                             | PASS |
------------------------------------------------------------------------------
Bug 59871 & Bug 69857 & Bug 81561 & Bug 83238 & Bug 83338 & Bug 83... | PASS |
3 critical tests, 3 passed, 0 failed
3 tests total, 3 passed, 0 failed
==============================================================================
Bug 59871 & Bug 69857 & Bug 81561 & Bug 83238 & Bug 83338 & Bug 83592 & Bug...
==============================================================================
bug_83749                                                             | PASS |
------------------------------------------------------------------------------
Bug 59871 & Bug 69857 & Bug 81561 & Bug 83238 & Bug 83338 & Bug 83... | PASS |
1 critical test, 1 passed, 0 failed
1 test total, 1 passed, 0 failed
==============================================================================
Bug 59871 & Bug 69857 & Bug 81561 & Bug 83238 & Bug 83338 & Bug 83592 & Bug...
==============================================================================
Set Log Level :: Set the log level used for the test suite. This c... | PASS |
------------------------------------------------------------------------------
bug_84374                                                             | PASS |
------------------------------------------------------------------------------
Bug 59871 & Bug 69857 & Bug 81561 & Bug 83238 & Bug 83338 & Bug 83... | PASS |
2 critical tests, 2 passed, 0 failed
2 tests total, 2 passed, 0 failed
==============================================================================
Bug 59871 & Bug 69857 & Bug 81561 & Bug 83238 & Bug 83338 & Bug 83592 & Bug...
==============================================================================
Set Log Level :: Set the log level used for the test suite. This c... | PASS |
------------------------------------------------------------------------------
bug_86191                                                             | PASS |
------------------------------------------------------------------------------
Bug 59871 & Bug 69857 & Bug 81561 & Bug 83238 & Bug 83338 & Bug 83... | PASS |
2 critical tests, 2 passed, 0 failed
2 tests total, 2 passed, 0 failed
==============================================================================
Bug 59871 & Bug 69857 & Bug 81561 & Bug 83238 & Bug 83338 & Bug 83592 & Bug...
==============================================================================
Set Log Level :: Set the log level used for the test suite. This c... | PASS |
------------------------------------------------------------------------------
bug_87361                                                             | PASS |
------------------------------------------------------------------------------
Bug 59871 & Bug 69857 & Bug 81561 & Bug 83238 & Bug 83338 & Bug 83... | PASS |
2 critical tests, 2 passed, 0 failed
2 tests total, 2 passed, 0 failed
==============================================================================
Bug 59871 & Bug 69857 & Bug 81561 & Bug 83238 & Bug 83338 & Bug 83592 & Bug...
==============================================================================
Set Log Level :: Set the log level used for the test suite. This c... | PASS |
------------------------------------------------------------------------------
bug_87492                                                             | PASS |
------------------------------------------------------------------------------
Bug 59871 & Bug 69857 & Bug 81561 & Bug 83238 & Bug 83338 & Bug 83... | PASS |
2 critical tests, 2 passed, 0 failed
2 tests total, 2 passed, 0 failed
==============================================================================
Bug 59871 & Bug 69857 & Bug 81561 & Bug 83238 & Bug 83338 & Bug 83592 & Bug...
==============================================================================
Set Log Level :: Set the log level used for the test suite. This c... | PASS |
------------------------------------------------------------------------------
bug_89489                                                             | PASS |
------------------------------------------------------------------------------
Bug 59871 & Bug 69857 & Bug 81561 & Bug 83238 & Bug 83338 & Bug 83... | PASS |
2 critical tests, 2 passed, 0 failed
2 tests total, 2 passed, 0 failed
==============================================================================
Bug 59871 & Bug 69857 & Bug 81561 & Bug 83238 & Bug 83338 & Bug 83592 & Bug...
==============================================================================
Set Log Level :: Set the log level used for the test suite. This c... | PASS |
------------------------------------------------------------------------------
bug_95356                                                             | PASS |
------------------------------------------------------------------------------
Bug 59871 & Bug 69857 & Bug 81561 & Bug 83238 & Bug 83338 & Bug 83... | PASS |
2 critical tests, 2 passed, 0 failed
2 tests total, 2 passed, 0 failed
==============================================================================
Bug 59871 & Bug 69857 & Bug 81561 & Bug 83238 & Bug 83338 & Bug 83592 & Bug...
==============================================================================
Set Log Level :: Set the log level used for the test suite. This c... | PASS |
------------------------------------------------------------------------------
Check Executables :: Check whether the needed executables for the ... | PASS |
------------------------------------------------------------------------------
bug_95552                                                             | PASS |
------------------------------------------------------------------------------
Bug 59871 & Bug 69857 & Bug 81561 & Bug 83238 & Bug 83338 & Bug 83... | PASS |
3 critical tests, 3 passed, 0 failed
3 tests total, 3 passed, 0 failed
==============================================================================
Bug 59871 & Bug 69857 & Bug 81561 & Bug 83238 & Bug 83338 & Bug 83592 & Bug...
==============================================================================
Set Log Level :: Set the log level used for the test suite. This c... | PASS |
------------------------------------------------------------------------------
bug_96306                                                             | FAIL |
CHECK FAILED != CHECK SUCCESSFUL
------------------------------------------------------------------------------
Teardown                                                              | PASS |
------------------------------------------------------------------------------
Bug 59871 & Bug 69857 & Bug 81561 & Bug 83238 & Bug 83338 & Bug 83... | FAIL |
3 critical tests, 2 passed, 1 failed
3 tests total, 2 passed, 1 failed
==============================================================================
Bug 59871 & Bug 69857 & Bug 81561 & Bug 83238 & Bug 83338 & Bug 83592 & Bug...
==============================================================================
Set Log Level :: Set the log level used for the test suite. This c... | PASS |
------------------------------------------------------------------------------
bug_96512                                                             | PASS |
------------------------------------------------------------------------------
Bug 59871 & Bug 69857 & Bug 81561 & Bug 83238 & Bug 83338 & Bug 83... | PASS |
2 critical tests, 2 passed, 0 failed
2 tests total, 2 passed, 0 failed
==============================================================================
Bug 59871 & Bug 69857 & Bug 81561 & Bug 83238 & Bug 83338 & Bug 83... | FAIL |
41 critical tests, 39 passed, 2 failed
41 tests total, 39 passed, 2 failed
==============================================================================
Output:  /home/bertocco/cream_blah_testsuites-master/cream_regression_testsuite/tests/output.xml
Log:     /home/bertocco/cream_blah_testsuites-master/cream_regression_testsuite/tests/log.html
Report:  /home/bertocco/cream_blah_testsuites-master/cream_regression_testsuite/tests/report.html

Bug #96306 (patch attached) manual verification:
      # cat /opt/glite/var/info/cream-48.pd.infn.it/dteam/dteam.list
      TESTTAGG 
      # ldapsearch -h cream-36.pd.infn.it -x -p 2170 -b "o=glite" | grep -i TESTTAGG
      # ldapsearch -h cream-36.pd.infn.it -x -p 2170 -b "o=glite" | grep -i GLUE2ApplicationEnvironmentID
      # ldapsearch -h cream-36.pd.infn.it -x -p 2170 -b "o=glite" | grep -i GLUE2ApplicationEnvironmentAppName

      BUT:
      # /var/lib/bdii/gip/plugin/glite-info-dynamic-software-wrapper |grep -i TESTTAGG
      GlueHostApplicationSoftwareRunTimeEnvironment: TESTTAGG
    
The information is not updated

Bug #96306 (old) manual verification:
      # /var/lib/bdii/gip/plugin/glite-info-dynamic-software-wrapper |grep -i tag
      GlueHostApplicationSoftwareRunTimeEnvironment: tag1
      GlueHostApplicationSoftwareRunTimeEnvironment: tag2
      GlueHostApplicationSoftwareRunTimeEnvironment: tag3
      # ldapsearch -h cream-36.pd.infn.it -x -p 2170 -b "o=glite" | grep  GlueHostApplicationSoftwareRunTimeEnvironment
    
The information is not updated
 

Integration testing

Line: 230 to 523
 
META FILEATTACHMENT attachment="CREAM_SL5_PBS_install_yum.log" attr="" comment="" date="1354636245" name="CREAM_SL5_PBS_install_yum.log" path="CREAM_SL5_PBS_install_yum.log" size="173013" user="SaraBertocco" version="1"
META FILEATTACHMENT attachment="CREAM_SL5_PBS_install_yaim.log" attr="" comment="" date="1354642425" name="CREAM_SL5_PBS_install_yaim.log" path="CREAM_SL5_PBS_install_yaim.log" size="5248" user="SaraBertocco" version="1"
META FILEATTACHMENT attachment="functionalityLSF.html.log" attr="" comment="" date="1354699088" name="functionalityLSF.html.log" path="functionalityLSF.html.log" size="453402" user="SaraBertocco" version="1"
Added:
>
>
META FILEATTACHMENT attachment="regressionLSF.html.log" attr="" comment="" date="1354715478" name="regressionLSF.html.log" path="regressionLSF.html.log" size="301622" user="SaraBertocco" version="1"

Revision 82012-12-05 - SaraBertocco

Line: 1 to 1
 
META TOPICPARENT name="TestingCreamDgas"

Testing report: IGIRTC-120

Line: 127 to 127
 

Regression tests

Verification attached bugs for CREAM Torque

Added:
>
>
 
Deleted:
<
<
Bug # FIXED
 

Verification attached bugs for CREAM LSF

Added:
>
>

Bug #97441: CREAM: Unwanted auto-updating of the field "creationTime" on the creamdb database FIXED
# mysql -u cremino -p creamdb
Enter password: 
Reading table information for completion of table and column names
You can turn off this feature to get a quicker startup with -A

Welcome to the MySQL monitor.  Commands end with ; or \g.
Your MySQL connection id is 2771
Server version: 5.0.95 Source distribution

Copyright (c) 2000, 2011, Oracle and/or its affiliates. All rights reserved.

Oracle is a registered trademark of Oracle Corporation and/or its
affiliates. Other names may be trademarks of their respective
owners.

Type 'help;' or '\h' for help. Type '\c' to clear the current input statement.

mysql>  select startUpTime, creationTime from db_info;
+---------------------+---------------------+
| startUpTime         | creationTime        |
+---------------------+---------------------+
| 2012-12-05 12:05:11 | 2012-12-05 11:59:11 | 
+---------------------+---------------------+
1 row in set (0.00 sec)

mysql> exit
Bye

# /opt/glite/yaim/bin/yaim -c -s /usr/local/nfs1/jra1_test/cream-48/site-info_lsf.def -n creamCE -n LSF_utils
.......
# mysql -u cremino -p creamdb
....
mysql>  select startUpTime, creationTime from db_info;
+---------------------+---------------------+
| startUpTime         | creationTime        |
+---------------------+---------------------+
| 2012-12-05 12:16:51 | 2012-12-05 11:59:11 | 
+---------------------+---------------------+
1 row in set (0.00 sec)
Bug #96310 Wrong lowercase conversion for Glue-1 VO Tags FIXED
# cat /opt/glite/var/info/cream-48.pd.infn.it/dteam/dteam.list
RMON3.1 
RMon3.1
# cat /opt/edg/var/info/dteam/dteam.list
RMON3.1 
RMon3.1
# grep GlueHostApplicationSoftwareRunTimeEnvironment: /var/lib/bdii/gip/ldif/static-file-Cluster.ldif
GlueHostApplicationSoftwareRunTimeEnvironment: LCG
GlueHostApplicationSoftwareRunTimeEnvironment: GLITE-3_2_0
GlueHostApplicationSoftwareRunTimeEnvironment: EMI
GlueHostApplicationSoftwareRunTimeEnvironment: MPIch
GlueHostApplicationSoftwareRunTimeEnvironment: MPICH

# /var/lib/bdii/gip/plugin/glite-info-dynamic-software-wrapper |grep -i RMON
GlueHostApplicationSoftwareRunTimeEnvironment: RMON3.1

# /var/lib/bdii/gip/plugin/glite-info-dynamic-software-wrapper |grep -i RMon
GlueHostApplicationSoftwareRunTimeEnvironment: RMON3.1

# /var/lib/bdii/gip/plugin/glite-info-dynamic-software-wrapper |grep GlueHostApplicationSoftwareRunTimeEnvironment
GlueHostApplicationSoftwareRunTimeEnvironment: EMI
GlueHostApplicationSoftwareRunTimeEnvironment: GLITE-3_2_0
GlueHostApplicationSoftwareRunTimeEnvironment: LCG
GlueHostApplicationSoftwareRunTimeEnvironment: MPIch
GlueHostApplicationSoftwareRunTimeEnvironment: RMON3.1
 
Changed:
<
<
Bug # FIXED
>
>
Bug #95973 Missing Glue capability in GLUE2EntityOtherInfo FIXED
# grep CE_CAPABILITY /opt/nfs_install/jra1_test/cream-48/services/glite-creamce
CE_CAPABILITY="CPUScalingReferenceSI00=10 SNMPSupport=yes"
#CE_CAPABILITY="CPUScalingReferenceSI00=10"

# ldapsearch -h cream-48.pd.infn.it -x -p 2170 -b "o=glue" | grep GLUE2EntityOtherInfo |grep CPUScalingReference
GLUE2EntityOtherInfo: CPUScalingReferenceSI00=10
# ldapsearch -h cream-48.pd.infn.it -x -p 2170 -b "o=glue" | grep GLUE2EntityOtherInfo |grep SNMPSupport
GLUE2EntityOtherInfo: SNMPSupport=yes
 
Added:
>
>
Bug # FIXED
 

Integration testing

Revision 72012-12-05 - SaraBertocco

Line: 1 to 1
 
META TOPICPARENT name="TestingCreamDgas"

Testing report: IGIRTC-120

Line: 52 to 52
 

CREAM PBS

CREAM LSF

Changed:
<
<
>
>
$ pybot -e job_man -e cpu_alloc -e glue -e ban -e bdii -e lb -e old_blah -e status /opt/cream_test/testsuite/cream_test_suite.html
INFO: The files of this testsuite will be stored under: /tmp/tmpskj86N.cream_testing/
INFO: Non-mandatory variable "sec_cert" has not been set.
INFO: Non-mandatory variable "sec_key" has not been set.
INFO: Non-mandatory variable "argus_host" has not been set.
INFO: Non-mandatory variable "sec_proxy_pass" has not been set.
==============================================================================
Cream Test Suite :: This is the main testing module,needed for testing the ...
==============================================================================
Set Log Level :: Set the log level used for the test suite. This c... | PASS |
------------------------------------------------------------------------------
Check Executables :: Check whether the needed executables for the ... | PASS |
------------------------------------------------------------------------------
Simple Submit :: Execute /bin/uname -a.Submit the jdl and wait for... | PASS |
------------------------------------------------------------------------------
ISB Base URI :: Execute a bash shell script.The script is stored i... | PASS |
------------------------------------------------------------------------------
ISB Client to CE :: Execute a bash shell script.The script is stor... | PASS |
------------------------------------------------------------------------------
ISB gsiftp to CE :: Execute a bash shell script.The script is stor... | PASS |
------------------------------------------------------------------------------
OSB localhost :: Execute /bin/uname -a.Store std out and error str... | PASS |
------------------------------------------------------------------------------
OSB gsiftp BaseDestURI :: Execute /bin/uname -a.Store std out and ... | PASS |
------------------------------------------------------------------------------
OSB gsiftp DestURI :: Execute /bin/uname -a.Store std out and erro... | PASS |
------------------------------------------------------------------------------
Environment :: Execute a bash shell script.The script is stored lo... | PASS |
------------------------------------------------------------------------------
Epilogue :: Execute two bash shell scripts,one for the job and the... | PASS |
------------------------------------------------------------------------------
Prologue :: Execute two bash shell scripts,one for the job and the... | PASS |
------------------------------------------------------------------------------
Explicit Delegation :: Test job submission with explicit delegatio... | PASS |
------------------------------------------------------------------------------
Job Cancel :: Test job cancellation.Two cases are tested:             | PASS |
------------------------------------------------------------------------------
Job List :: Test the job listing cli utility.Store the list of the... | PASS |
------------------------------------------------------------------------------
Job Suspend - Resume :: Submit a job and suspend it.Wait until it'... | PASS |
------------------------------------------------------------------------------
Manually Cancel Job :: Submit a job and then manually cancel it on... | PASS |
------------------------------------------------------------------------------
Verify CE service info :: This test case verifies the output of th... | PASS |
------------------------------------------------------------------------------
Enable - Disable Submission :: This test case tests the proper fun... | PASS |
------------------------------------------------------------------------------
Job Purge :: This test case verifies the proper functionality of t... | PASS |
------------------------------------------------------------------------------
Limiter :: NOTE: This test case is about 25 minutes long!             | PASS |
------------------------------------------------------------------------------
Sandbox Staging :: This test case tests the two different Sandbox ... | PASS |
------------------------------------------------------------------------------
Automatic Proxy Purging :: This test case checks the automatic pro... | PASS |
------------------------------------------------------------------------------
OutputData :: This test case tests the OutputData jdl attribute. T... | PASS |
------------------------------------------------------------------------------
Automatic Job Purge :: This test case is testing the functionality... | PASS |
------------------------------------------------------------------------------
Proxy Renewal :: Submit a job lasting 20 minutes using a proxy val... | PASS |
------------------------------------------------------------------------------
Cream Test Suite :: This is the main testing module,needed for tes... | PASS |
26 critical tests, 26 passed, 0 failed
26 tests total, 26 passed, 0 failed
==============================================================================
Output:  /home/bertocco/output.xml
Log:     /home/bertocco/log.html
Report:  /home/bertocco/report.html
 

Regression tests

Line: 75 to 145
 
META FILEATTACHMENT attachment="CREAM_SL5_install_yaim.log" attr="" comment="" date="1354633819" name="CREAM_SL5_install_yaim.log" path="CREAM_SL5_install_yaim.log" size="13659" user="SaraBertocco" version="1"
META FILEATTACHMENT attachment="CREAM_SL5_PBS_install_yum.log" attr="" comment="" date="1354636245" name="CREAM_SL5_PBS_install_yum.log" path="CREAM_SL5_PBS_install_yum.log" size="173013" user="SaraBertocco" version="1"
META FILEATTACHMENT attachment="CREAM_SL5_PBS_install_yaim.log" attr="" comment="" date="1354642425" name="CREAM_SL5_PBS_install_yaim.log" path="CREAM_SL5_PBS_install_yaim.log" size="5248" user="SaraBertocco" version="1"
Added:
>
>
META FILEATTACHMENT attachment="functionalityLSF.html.log" attr="" comment="" date="1354699088" name="functionalityLSF.html.log" path="functionalityLSF.html.log" size="453402" user="SaraBertocco" version="1"

Revision 62012-12-04 - SaraBertocco

Line: 1 to 1
 
META TOPICPARENT name="TestingCreamDgas"

Testing report: IGIRTC-120

Line: 24 to 24
 

CREAM PBS

Changed:
<
<
  • [[][Configuration log file]]
>
>
 

CREAM LSF

Line: 74 to 74
 
META FILEATTACHMENT attachment="CREAM_SL5_LSF_install_yum.log" attr="" comment="" date="1354632893" name="CREAM_SL5_LSF_install_yum.log" path="CREAM_SL5_LSF_install_yum.log" size="165287" user="SaraBertocco" version="1"
META FILEATTACHMENT attachment="CREAM_SL5_install_yaim.log" attr="" comment="" date="1354633819" name="CREAM_SL5_install_yaim.log" path="CREAM_SL5_install_yaim.log" size="13659" user="SaraBertocco" version="1"
META FILEATTACHMENT attachment="CREAM_SL5_PBS_install_yum.log" attr="" comment="" date="1354636245" name="CREAM_SL5_PBS_install_yum.log" path="CREAM_SL5_PBS_install_yum.log" size="173013" user="SaraBertocco" version="1"
Added:
>
>
META FILEATTACHMENT attachment="CREAM_SL5_PBS_install_yaim.log" attr="" comment="" date="1354642425" name="CREAM_SL5_PBS_install_yaim.log" path="CREAM_SL5_PBS_install_yaim.log" size="5248" user="SaraBertocco" version="1"

Revision 52012-12-04 - SaraBertocco

Line: 1 to 1
 
META TOPICPARENT name="TestingCreamDgas"

Testing report: IGIRTC-120

Line: 23 to 23
 

Clean Installation

CREAM PBS

Changed:
<
<
    • [[][Installation log file]]
>
>
 
    • [[][Configuration log file]]

CREAM LSF

Changed:
<
<
    • [[][Installation log file]]
    • [[][Configuration log file]]
>
>
 

Upgrade Installation

Line: 69 to 70
 

-- SaraBertocco - 2012-11-23

Added:
>
>
META FILEATTACHMENT attachment="CREAM_SL5_LSF_install_yum.log" attr="" comment="" date="1354632893" name="CREAM_SL5_LSF_install_yum.log" path="CREAM_SL5_LSF_install_yum.log" size="165287" user="SaraBertocco" version="1"
META FILEATTACHMENT attachment="CREAM_SL5_install_yaim.log" attr="" comment="" date="1354633819" name="CREAM_SL5_install_yaim.log" path="CREAM_SL5_install_yaim.log" size="13659" user="SaraBertocco" version="1"
META FILEATTACHMENT attachment="CREAM_SL5_PBS_install_yum.log" attr="" comment="" date="1354636245" name="CREAM_SL5_PBS_install_yum.log" path="CREAM_SL5_PBS_install_yum.log" size="173013" user="SaraBertocco" version="1"

Revision 42012-12-03 - SaraBertocco

Line: 1 to 1
 
META TOPICPARENT name="TestingCreamDgas"

Testing report: IGIRTC-120

Line: 47 to 47
 

System tests

Functionality tests

Deleted:
<
<
 pybot -e job_man -e cpu_alloc -e glue -e ban -e bdii -e lb -e old_blah -e status /opt/cream_test/testsuite/cream_test_suite.html
INFO: The files of this testsuite will be stored under: /tmp/tmpryBt_X.cream_testing/
INFO: Non-mandatory variable "sec_cert" has not been set.
INFO: Non-mandatory variable "sec_key" has not been set.
INFO: Non-mandatory variable "argus_host" has not been set.
INFO: Non-mandatory variable "sec_proxy_pass" has not been set.
==============================================================================
Cream Test Suite :: This is the main testing module,needed for testing the ...
==============================================================================
Set Log Level :: Set the log level used for the test suite. This c... | PASS |
------------------------------------------------------------------------------
Check Executables :: Check whether the needed executables for the ... | PASS |
------------------------------------------------------------------------------
Simple Submit :: Execute /bin/uname -a.Submit the jdl and wait for... | PASS |
------------------------------------------------------------------------------
ISB Base URI :: Execute a bash shell script.The script is stored i... | PASS |
------------------------------------------------------------------------------
ISB Client to CE :: Execute a bash shell script.The script is stor... | PASS |
------------------------------------------------------------------------------
ISB gsiftp to CE :: Execute a bash shell script.The script is stor... | PASS |
------------------------------------------------------------------------------
OSB localhost :: Execute /bin/uname -a.Store std out and error str... | PASS |
------------------------------------------------------------------------------
OSB gsiftp BaseDestURI :: Execute /bin/uname -a.Store std out and ... | PASS |
------------------------------------------------------------------------------
OSB gsiftp DestURI :: Execute /bin/uname -a.Store std out and erro... | PASS |
------------------------------------------------------------------------------
Environment :: Execute a bash shell script.The script is stored lo... | PASS |
------------------------------------------------------------------------------
Epilogue :: Execute two bash shell scripts,one for the job and the... | PASS |
------------------------------------------------------------------------------
Prologue :: Execute two bash shell scripts,one for the job and the... | PASS |
------------------------------------------------------------------------------
Explicit Delegation :: Test job submission with explicit delegatio... | PASS |
------------------------------------------------------------------------------
Job Cancel :: Test job cancellation.Two cases are tested:             | PASS |
------------------------------------------------------------------------------
Job List :: Test the job listing cli utility.Store the list of the... | PASS |
------------------------------------------------------------------------------
Job Suspend - Resume :: Submit a job and suspend it.Wait until it'... | PASS |
------------------------------------------------------------------------------
Manually Cancel Job :: Submit a job and then manually cancel it on... | PASS |
------------------------------------------------------------------------------
Verify CE service info :: This test case verifies the output of th... | PASS |
------------------------------------------------------------------------------
Enable - Disable Submission :: This test case tests the proper fun... | PASS |
------------------------------------------------------------------------------
Job Purge :: This test case verifies the proper functionality of t... | PASS |
------------------------------------------------------------------------------
Limiter :: NOTE: This test case is about 25 minutes long!             | PASS |
------------------------------------------------------------------------------
Sandbox Staging :: This test case tests the two different Sandbox ... | PASS |
------------------------------------------------------------------------------
Automatic Proxy Purging :: This test case checks the automatic pro... | PASS |
------------------------------------------------------------------------------
OutputData :: This test case tests the OutputData jdl attribute. T... | PASS |
------------------------------------------------------------------------------
Automatic Job Purge :: This test case is testing the functionality... | PASS |
------------------------------------------------------------------------------
Proxy Renewal :: Submit a job lasting 20 minutes using a proxy val... | PASS |
------------------------------------------------------------------------------
Cream Test Suite :: This is the main testing module,needed for tes... | PASS |
26 critical tests, 26 passed, 0 failed
26 tests total, 26 passed, 0 failed
==============================================================================
Output:  /home/bertocco/.ssh/output.xml
Log:     /home/bertocco/.ssh/log.html
Report:  /home/bertocco/.ssh/report.html

$ pybot -i ban /opt/cream_test/testsuite/cream_test_suite.html  
INFO: The files of this testsuite will be stored under: /tmp/tmpwdRNS1.cream_testing/
INFO: Non-mandatory variable "sec_cert" has not been set.
INFO: Non-mandatory variable "sec_key" has not been set.
INFO: Non-mandatory variable "argus_host" has not been set.
INFO: Non-mandatory variable "sec_proxy_pass" has not been set.
==============================================================================
Cream Test Suite :: This is the main testing module,needed for testing the ...
==============================================================================
Ban User :: This test case tests if the banning of user works. The... | PASS |
------------------------------------------------------------------------------
Cream Test Suite :: This is the main testing module,needed for tes... | PASS |
1 critical test, 1 passed, 0 failed
1 test total, 1 passed, 0 failed
==============================================================================
Output:  /home/bertocco/.ssh/output.xml
Log:     /home/bertocco/.ssh/log.html
Report:  /home/bertocco/.ssh/report.html

$ pybot -i cpu_alloc /opt/cream_test/testsuite/cream_test_suite.html  
INFO: The files of this testsuite will be stored under: /tmp/tmpAMdB1O.cream_testing/
INFO: Non-mandatory variable "sec_cert" has not been set.
INFO: Non-mandatory variable "sec_key" has not been set.
INFO: Non-mandatory variable "argus_host" has not been set.
INFO: Non-mandatory variable "sec_proxy_pass" has not been set.
==============================================================================
Cream Test Suite :: This is the main testing module,needed for testing the ...
==============================================================================
CPU Allocation 1 :: Validate the contents of the batch job submiss... | PASS |
------------------------------------------------------------------------------
CPU Allocation 2 :: Validate the contents of the batch job submiss... | PASS |
------------------------------------------------------------------------------
CPU Allocation 3 :: Validate the contents of the batch job submiss... | PASS |
------------------------------------------------------------------------------
CPU Allocation 4 :: Validate the contents of the batch job submiss... | PASS |
------------------------------------------------------------------------------
CPU Allocation 5 :: Validate the contents of the batch job submiss... | PASS |
------------------------------------------------------------------------------
CPU Allocation 6 :: Validate the contents of the batch job submiss... | PASS |
------------------------------------------------------------------------------
Cream Test Suite :: This is the main testing module,needed for tes... | PASS |
6 critical tests, 6 passed, 0 failed
6 tests total, 6 passed, 0 failed
==============================================================================
Output:  /home/bertocco/.ssh/output.xml
Log:     /home/bertocco/.ssh/log.html
Report:  /home/bertocco/.ssh/report.html

Excluded tests:

  • job_man (Admin Manage Job) has been excluded because it requires 2 user proxies and the certifier has one only.
 

CREAM PBS

Line: 198 to 69
 

-- SaraBertocco - 2012-11-23

Deleted:
<
<
META FILEATTACHMENT attachment="log1.html.txt" attr="" comment="" date="1354541146" name="log1.html.txt" path="log1.html.txt" size="451702" user="SaraBertocco" version="1"
META FILEATTACHMENT attachment="log_ban.html.txt" attr="" comment="" date="1354541971" name="log_ban.html.txt" path="log_ban.html.txt" size="175378" user="SaraBertocco" version="1"
META FILEATTACHMENT attachment="log_cpu_alloc.html.txt" attr="" comment="" date="1354542531" name="log_cpu_alloc.html.txt" path="log_cpu_alloc.html.txt" size="196387" user="SaraBertocco" version="1"

Revision 32012-12-03 - SaraBertocco

Line: 1 to 1
 
META TOPICPARENT name="TestingCreamDgas"

Testing report: IGIRTC-120

Line: 47 to 47
 

System tests

Functionality tests

Added:
>
>
 pybot -e job_man -e cpu_alloc -e glue -e ban -e bdii -e lb -e old_blah -e status /opt/cream_test/testsuite/cream_test_suite.html
INFO: The files of this testsuite will be stored under: /tmp/tmpryBt_X.cream_testing/
INFO: Non-mandatory variable "sec_cert" has not been set.
INFO: Non-mandatory variable "sec_key" has not been set.
INFO: Non-mandatory variable "argus_host" has not been set.
INFO: Non-mandatory variable "sec_proxy_pass" has not been set.
==============================================================================
Cream Test Suite :: This is the main testing module,needed for testing the ...
==============================================================================
Set Log Level :: Set the log level used for the test suite. This c... | PASS |
------------------------------------------------------------------------------
Check Executables :: Check whether the needed executables for the ... | PASS |
------------------------------------------------------------------------------
Simple Submit :: Execute /bin/uname -a.Submit the jdl and wait for... | PASS |
------------------------------------------------------------------------------
ISB Base URI :: Execute a bash shell script.The script is stored i... | PASS |
------------------------------------------------------------------------------
ISB Client to CE :: Execute a bash shell script.The script is stor... | PASS |
------------------------------------------------------------------------------
ISB gsiftp to CE :: Execute a bash shell script.The script is stor... | PASS |
------------------------------------------------------------------------------
OSB localhost :: Execute /bin/uname -a.Store std out and error str... | PASS |
------------------------------------------------------------------------------
OSB gsiftp BaseDestURI :: Execute /bin/uname -a.Store std out and ... | PASS |
------------------------------------------------------------------------------
OSB gsiftp DestURI :: Execute /bin/uname -a.Store std out and erro... | PASS |
------------------------------------------------------------------------------
Environment :: Execute a bash shell script.The script is stored lo... | PASS |
------------------------------------------------------------------------------
Epilogue :: Execute two bash shell scripts,one for the job and the... | PASS |
------------------------------------------------------------------------------
Prologue :: Execute two bash shell scripts,one for the job and the... | PASS |
------------------------------------------------------------------------------
Explicit Delegation :: Test job submission with explicit delegatio... | PASS |
------------------------------------------------------------------------------
Job Cancel :: Test job cancellation.Two cases are tested:             | PASS |
------------------------------------------------------------------------------
Job List :: Test the job listing cli utility.Store the list of the... | PASS |
------------------------------------------------------------------------------
Job Suspend - Resume :: Submit a job and suspend it.Wait until it'... | PASS |
------------------------------------------------------------------------------
Manually Cancel Job :: Submit a job and then manually cancel it on... | PASS |
------------------------------------------------------------------------------
Verify CE service info :: This test case verifies the output of th... | PASS |
------------------------------------------------------------------------------
Enable - Disable Submission :: This test case tests the proper fun... | PASS |
------------------------------------------------------------------------------
Job Purge :: This test case verifies the proper functionality of t... | PASS |
------------------------------------------------------------------------------
Limiter :: NOTE: This test case is about 25 minutes long!             | PASS |
------------------------------------------------------------------------------
Sandbox Staging :: This test case tests the two different Sandbox ... | PASS |
------------------------------------------------------------------------------
Automatic Proxy Purging :: This test case checks the automatic pro... | PASS |
------------------------------------------------------------------------------
OutputData :: This test case tests the OutputData jdl attribute. T... | PASS |
------------------------------------------------------------------------------
Automatic Job Purge :: This test case is testing the functionality... | PASS |
------------------------------------------------------------------------------
Proxy Renewal :: Submit a job lasting 20 minutes using a proxy val... | PASS |
------------------------------------------------------------------------------
Cream Test Suite :: This is the main testing module,needed for tes... | PASS |
26 critical tests, 26 passed, 0 failed
26 tests total, 26 passed, 0 failed
==============================================================================
Output:  /home/bertocco/.ssh/output.xml
Log:     /home/bertocco/.ssh/log.html
Report:  /home/bertocco/.ssh/report.html

$ pybot -i ban /opt/cream_test/testsuite/cream_test_suite.html  
INFO: The files of this testsuite will be stored under: /tmp/tmpwdRNS1.cream_testing/
INFO: Non-mandatory variable "sec_cert" has not been set.
INFO: Non-mandatory variable "sec_key" has not been set.
INFO: Non-mandatory variable "argus_host" has not been set.
INFO: Non-mandatory variable "sec_proxy_pass" has not been set.
==============================================================================
Cream Test Suite :: This is the main testing module,needed for testing the ...
==============================================================================
Ban User :: This test case tests if the banning of user works. The... | PASS |
------------------------------------------------------------------------------
Cream Test Suite :: This is the main testing module,needed for tes... | PASS |
1 critical test, 1 passed, 0 failed
1 test total, 1 passed, 0 failed
==============================================================================
Output:  /home/bertocco/.ssh/output.xml
Log:     /home/bertocco/.ssh/log.html
Report:  /home/bertocco/.ssh/report.html

$ pybot -i cpu_alloc /opt/cream_test/testsuite/cream_test_suite.html  
INFO: The files of this testsuite will be stored under: /tmp/tmpAMdB1O.cream_testing/
INFO: Non-mandatory variable "sec_cert" has not been set.
INFO: Non-mandatory variable "sec_key" has not been set.
INFO: Non-mandatory variable "argus_host" has not been set.
INFO: Non-mandatory variable "sec_proxy_pass" has not been set.
==============================================================================
Cream Test Suite :: This is the main testing module,needed for testing the ...
==============================================================================
CPU Allocation 1 :: Validate the contents of the batch job submiss... | PASS |
------------------------------------------------------------------------------
CPU Allocation 2 :: Validate the contents of the batch job submiss... | PASS |
------------------------------------------------------------------------------
CPU Allocation 3 :: Validate the contents of the batch job submiss... | PASS |
------------------------------------------------------------------------------
CPU Allocation 4 :: Validate the contents of the batch job submiss... | PASS |
------------------------------------------------------------------------------
CPU Allocation 5 :: Validate the contents of the batch job submiss... | PASS |
------------------------------------------------------------------------------
CPU Allocation 6 :: Validate the contents of the batch job submiss... | PASS |
------------------------------------------------------------------------------
Cream Test Suite :: This is the main testing module,needed for tes... | PASS |
6 critical tests, 6 passed, 0 failed
6 tests total, 6 passed, 0 failed
==============================================================================
Output:  /home/bertocco/.ssh/output.xml
Log:     /home/bertocco/.ssh/log.html
Report:  /home/bertocco/.ssh/report.html

Excluded tests:

  • job_man (Admin Manage Job) has been excluded because it requires 2 user proxies and the certifier has one only.
 

CREAM PBS

Line: 70 to 199
  -- SaraBertocco - 2012-11-23
Added:
>
>
META FILEATTACHMENT attachment="log1.html.txt" attr="" comment="" date="1354541146" name="log1.html.txt" path="log1.html.txt" size="451702" user="SaraBertocco" version="1"
META FILEATTACHMENT attachment="log_ban.html.txt" attr="" comment="" date="1354541971" name="log_ban.html.txt" path="log_ban.html.txt" size="175378" user="SaraBertocco" version="1"
META FILEATTACHMENT attachment="log_cpu_alloc.html.txt" attr="" comment="" date="1354542531" name="log_cpu_alloc.html.txt" path="log_cpu_alloc.html.txt" size="196387" user="SaraBertocco" version="1"

Revision 22012-12-03 - SaraBertocco

Line: 1 to 1
 
META TOPICPARENT name="TestingCreamDgas"

Testing report: IGIRTC-120

Line: 37 to 37
 
    • [[][Configuration log file]]

CREAM LSF

Changed:
<
<
>
>
 

Unit Tests

Line: 70 to 70
  -- SaraBertocco - 2012-11-23
Deleted:
<
<
META FILEATTACHMENT attachment="CREAM_SL5_LSF_update_yum.log" attr="" comment="" date="1353676474" name="CREAM_SL5_LSF_update_yum.log" path="CREAM_SL5_LSF_update_yum.log" size="6783" user="SaraBertocco" version="1"
META FILEATTACHMENT attachment="CREAM_SL5_LSF_update_yaim.log" attr="" comment="" date="1353676474" name="CREAM_SL5_LSF_update_yaim.log" path="CREAM_SL5_LSF_update_yaim.log" size="35535" user="SaraBertocco" version="1"

Revision 12012-11-23 - SaraBertocco

Line: 1 to 1
Added:
>
>
META TOPICPARENT name="TestingCreamDgas"

Testing report: IGIRTC-120

Summary

  • Product: CREAM v. 1.14.2
  • Release Task: Task #34089
  • ETICS Subsystem Configuration Name:
  • VCS Tag:
  • EMI Major Release: EMI 2 (Matterhorn)
  • Platform: SL5 epel
  • Author: Sara Bertocco
  • Testing report: [[][Testing Report file]]
  • Certification report: [[][Certification Report file]]
  • Outcome: "In Certification*

Deployment tests

Clean Installation

CREAM PBS

    • [[][Installation log file]]
    • [[][Configuration log file]]

CREAM LSF

    • [[][Installation log file]]
    • [[][Configuration log file]]

Upgrade Installation

CREAM PBS

    • [[][Update log file]]
    • [[][Configuration log file]]

CREAM LSF

Unit Tests

System tests

Functionality tests

CREAM PBS

CREAM LSF

Regression tests

Verification attached bugs for CREAM Torque

Bug # FIXED

Verification attached bugs for CREAM LSF

Bug # FIXED

Integration testing

-- SaraBertocco - 2012-11-23

META FILEATTACHMENT attachment="CREAM_SL5_LSF_update_yum.log" attr="" comment="" date="1353676474" name="CREAM_SL5_LSF_update_yum.log" path="CREAM_SL5_LSF_update_yum.log" size="6783" user="SaraBertocco" version="1"
META FILEATTACHMENT attachment="CREAM_SL5_LSF_update_yaim.log" attr="" comment="" date="1353676474" name="CREAM_SL5_LSF_update_yaim.log" path="CREAM_SL5_LSF_update_yaim.log" size="35535" user="SaraBertocco" version="1"
 
This site is powered by the TWiki collaboration platformCopyright © 2008-2019 by the contributing authors. All material on this collaboration platform is the property of the contributing authors.
Ideas, requests, problems regarding TWiki? Send feedback