Difference: EMI2CREAMTask38531SL5 (1 vs. 12)

Revision 122013-03-31 - CristinaAiftimiei

Line: 1 to 1
 
META TOPICPARENT name="EMI2CREAMTask38531"

CREAM v. 1.14.3 (family) - Testing report SL5: IGIRTC-125

Line: 15 to 15
 
  • Author: Sara Bertocco
  • Testing report: [[][Testing Report file]]
  • Certification report: [[][Certification Report file]]
Changed:
<
<
  • Outcome: "In Certification*
>
>
  • Outcome: "Certified*
 

Deployment tests

Revision 112013-02-17 - CristinaAiftimiei

Line: 1 to 1
 
META TOPICPARENT name="EMI2CREAMTask38531"

CREAM v. 1.14.3 (family) - Testing report SL5: IGIRTC-125

Line: 448 to 448
 

Standard conformance tests

Changed:
<
<

Glue 1 Compliance

  • glue-validator -t glue1 -h cert-41.pd.infn.it -p 2170 -b o=grid 
    log
>
>

Glue 1 Compliance - PASSED

  • [root@cream-48 ~]# glue-validator -t glue1 -h cream-48.pd.infn.it -p 2170 -b o=grid
    Validating data types. ... ok
    Verifying the existence of mandatory attributes. ... ok
    Verifying the object class ... ok
    Verifying single-valued attributes only have one value. ... ok
    Validating data types. ... ok
    Verifying the existence of mandatory attributes. ... ok
    Verifying the object class ... ok
    Verifying single-valued attributes only have one value. ... ok
    Validating data types. ... ok
    Verifying the existence of mandatory attributes. ... ok
    Verifying the object class ... ok
    Verifying single-valued attributes only have one value. ... ok
    Validating data types. ... ok
    Verifying the existence of mandatory attributes. ... ok
    Verifying the object class ... ok
    Verifying single-valued attributes only have one value. ... ok
    Validating data types. ... ok
    Verifying the existence of mandatory attributes. ... ok
    Verifying the object class ... ok
    Verifying single-valued attributes only have one value. ... ok
    Validating data types. ... ok
    Verifying the existence of mandatory attributes. ... ok
    Verifying the object class ... ok
    Verifying single-valued attributes only have one value. ... ok
    Validating data types. ... ok
    Verifying the existence of mandatory attributes. ... ok
    Verifying the object class ... ok
    Verifying single-valued attributes only have one value. ... ok
    Validating data types. ... ok
    Verifying the existence of mandatory attributes. ... ok
    Verifying the object class ... ok
    Verifying single-valued attributes only have one value. ... ok
    Validating data types. ... ok
    Verifying the existence of mandatory attributes. ... ok
    Verifying the object class ... ok
    Verifying single-valued attributes only have one value. ... ok
    Validating data types. ... ok
    Verifying the existence of mandatory attributes. ... ok
    Verifying the object class ... ok
    Verifying single-valued attributes only have one value. ... ok
    Validating data types. ... ok
    Verifying the existence of mandatory attributes. ... ok
    Verifying the object class ... ok
    Verifying single-valued attributes only have one value. ... ok
    Validating data types. ... ok
    Verifying the existence of mandatory attributes. ... ok
    Verifying the object class ... ok
    Verifying single-valued attributes only have one value. ... ok
    Validating data types. ... ok
    Verifying the existence of mandatory attributes. ... ok
    Verifying the object class ... ok
    Verifying single-valued attributes only have one value. ... ok
    Validating data types. ... ok
    Verifying the existence of mandatory attributes. ... ok
    Verifying the object class ... ok
    Verifying single-valued attributes only have one value. ... ok
    Validating data types. ... ok
    Verifying the existence of mandatory attributes. ... ok
    Verifying the object class ... ok
    Verifying single-valued attributes only have one value. ... ok
    Validating data types. ... ok
    Verifying the existence of mandatory attributes. ... ok
    Verifying the object class ... ok
    Verifying single-valued attributes only have one value. ... ok
    Validating data types. ... ok
    Verifying the existence of mandatory attributes. ... ok
    Verifying the object class ... ok
    Verifying single-valued attributes only have one value. ... ok
    Validating data types. ... ok
    Verifying the existence of mandatory attributes. ... ok
    Verifying the object class ... ok
    Verifying single-valued attributes only have one value. ... ok
    Validating data types. ... ok
    Verifying the existence of mandatory attributes. ... ok
    Verifying the object class ... ok
    Verifying single-valued attributes only have one value. ... ok
    Validating data types. ... ok
    Verifying the existence of mandatory attributes. ... ok
    Verifying the object class ... ok
    Verifying single-valued attributes only have one value. ... ok
    Validating data types. ... ok
    Verifying the existence of mandatory attributes. ... ok
    Verifying the object class ... ok
    Verifying single-valued attributes only have one value. ... ok
    Validating data types. ... ok
    Verifying the existence of mandatory attributes. ... ok
    Verifying the object class ... ok
    Verifying single-valued attributes only have one value. ... ok
    Validating data types. ... ok
    Verifying the existence of mandatory attributes. ... ok
    Verifying the object class ... ok
    Verifying single-valued attributes only have one value. ... ok
    Validating data types. ... ok
    Verifying the existence of mandatory attributes. ... ok
    Verifying the object class ... ok
    Verifying single-valued attributes only have one value. ... ok
    Validating data types. ... ok
    Verifying the existence of mandatory attributes. ... ok
    Verifying the object class ... ok
    Verifying single-valued attributes only have one value. ... ok
    
    ----------------------------------------------------------------------
    Ran 100 tests in 0.024s
    
    OK

Glue 2 Compliance - PASSED

[root@cream-48 ~]# glue-validator -t glue2 -h cream-48.pd.infn.it -p 2170 -b o=glue
Validating data types. ... ok
Verifying the existence of mandatory attributes. ... ok
Verifying the object class ... ok
Verifying single-valued attributes only have one value. ... ok
Validating data types. ... ok
Verifying the existence of mandatory attributes. ... ok
Verifying the object class ... ok
Verifying single-valued attributes only have one value. ... ok
Validating data types. ... ok
Verifying the existence of mandatory attributes. ... ok
Verifying the object class ... ok
Verifying single-valued attributes only have one value. ... ok
Validating data types. ... ok
Verifying the existence of mandatory attributes. ... ok
Verifying the object class ... ok
Verifying single-valued attributes only have one value. ... ok
Validating data types. ... ok
Verifying the existence of mandatory attributes. ... ok
Verifying the object class ... ok
Verifying single-valued attributes only have one value. ... ok
Validating data types. ... ok
Verifying the existence of mandatory attributes. ... ok
Verifying the object class ... ok
Verifying single-valued attributes only have one value. ... ok
Validating data types. ... FAIL
Verifying the existence of mandatory attributes. ... ok
Verifying the object class ... ok
Verifying single-valued attributes only have one value. ... ok
Validating data types. ... ok
Verifying the existence of mandatory attributes. ... ok
Verifying the object class ... ok
Verifying single-valued attributes only have one value. ... ok
Validating data types. ... ok
Verifying the existence of mandatory attributes. ... ok
Verifying the object class ... ok
Verifying single-valued attributes only have one value. ... ok
Validating data types. ... ok
Verifying the existence of mandatory attributes. ... ok
Verifying the object class ... ok
Verifying single-valued attributes only have one value. ... ok
Validating data types. ... ok
Verifying the existence of mandatory attributes. ... ok
Verifying the object class ... ok
Verifying single-valued attributes only have one value. ... ok
Validating data types. ... ok
Verifying the existence of mandatory attributes. ... ok
Verifying the object class ... ok
Verifying single-valued attributes only have one value. ... ok
Validating data types. ... ok
Verifying the existence of mandatory attributes. ... ok
Verifying the object class ... ok
Verifying single-valued attributes only have one value. ... ok
Validating data types. ... ok
Verifying the existence of mandatory attributes. ... ok
Verifying the object class ... ok
Verifying single-valued attributes only have one value. ... ok
Validating data types. ... ok
Verifying the existence of mandatory attributes. ... ok
Verifying the object class ... ok
Verifying single-valued attributes only have one value. ... ok
Validating data types. ... ok
Verifying the existence of mandatory attributes. ... ok
Verifying the object class ... ok
Verifying single-valued attributes only have one value. ... ok
Validating data types. ... FAIL
Verifying the existence of mandatory attributes. ... ok
Verifying the object class ... ok
Verifying single-valued attributes only have one value. ... ok
Validating data types. ... FAIL
Verifying the existence of mandatory attributes. ... ok
Verifying the object class ... ok
Verifying single-valued attributes only have one value. ... ok
Validating data types. ... ok
Verifying the existence of mandatory attributes. ... ok
Verifying the object class ... ok
Verifying single-valued attributes only have one value. ... ok
Validating data types. ... ok
Verifying the existence of mandatory attributes. ... ok
Verifying the object class ... ok
Verifying single-valued attributes only have one value. ... ok
Validating data types. ... FAIL
Verifying the existence of mandatory attributes. ... ok
Verifying the object class ... ok
Verifying single-valued attributes only have one value. ... ok
Validating data types. ... ok
Verifying the existence of mandatory attributes. ... ok
Verifying the object class ... ok
Verifying single-valued attributes only have one value. ... ok
Validating data types. ... FAIL
Verifying the existence of mandatory attributes. ... ok
Verifying the object class ... ok
Verifying single-valued attributes only have one value. ... ok
Validating data types. ... ok
Verifying the existence of mandatory attributes. ... ok
Verifying the object class ... ok
Verifying single-valued attributes only have one value. ... ok
Validating data types. ... ok
Verifying the existence of mandatory attributes. ... ok
Verifying the object class ... ok
Verifying single-valued attributes only have one value. ... ok
Validating data types. ... ok
Verifying the existence of mandatory attributes. ... ok
Verifying the object class ... ok
Verifying single-valued attributes only have one value. ... ok
Validating data types. ... ok
Verifying the existence of mandatory attributes. ... ok
Verifying the object class ... ok
Verifying single-valued attributes only have one value. ... ok
Validating data types. ... ok
Verifying the existence of mandatory attributes. ... ok
Verifying the object class ... ok
Verifying single-valued attributes only have one value. ... ok
Validating data types. ... ok
Verifying the existence of mandatory attributes. ... ok
Verifying the object class ... ok
Verifying single-valued attributes only have one value. ... ok
Validating data types. ... ok
Verifying the existence of mandatory attributes. ... ok
Verifying the object class ... ok
Verifying single-valued attributes only have one value. ... ok
Validating data types. ... ok
Verifying the existence of mandatory attributes. ... ok
Verifying the object class ... ok
Verifying single-valued attributes only have one value. ... ok
Validating data types. ... ok
Verifying the existence of mandatory attributes. ... ok
Verifying the object class ... ok
Verifying single-valued attributes only have one value. ... ok
Validating data types. ... ok
Verifying the existence of mandatory attributes. ... ok
Verifying the object class ... ok
Verifying single-valued attributes only have one value. ... ok
Validating data types. ... ok
Verifying the existence of mandatory attributes. ... ok
Verifying the object class ... ok
Verifying single-valued attributes only have one value. ... ok
Validating data types. ... ok
Verifying the existence of mandatory attributes. ... ok
Verifying the object class ... ok
Verifying single-valued attributes only have one value. ... ok
Validating data types. ... ok
Verifying the existence of mandatory attributes. ... ok
Verifying the object class ... ok
Verifying single-valued attributes only have one value. ... ok
Validating data types. ... ok
Verifying the existence of mandatory attributes. ... ok
Verifying the object class ... ok
Verifying single-valued attributes only have one value. ... ok
Validating data types. ... ok
Verifying the existence of mandatory attributes. ... ok
Verifying the object class ... ok
Verifying single-valued attributes only have one value. ... ok
Validating data types. ... ok
Verifying the existence of mandatory attributes. ... ok
Verifying the object class ... ok
Verifying single-valued attributes only have one value. ... ok

======================================================================
FAIL: Validating data types.
----------------------------------------------------------------------
Traceback (most recent call last):
  File "/usr/lib/python2.4/site-packages/validator/EntryTest.py", line 60, in test_data_types
    self.assertTrue(check(value), message)
AssertionError: The field GLUE2ComputingShareServingState with value 'testjra1' does not follow the type ServingState_t in GLUE2ShareID=creamtest2_dteam_cream-48.pd.infn.it_ComputingElement,GLUE2ServiceID=cream-48.pd.infn.it_ComputingElement,GLUE2GroupID=resource,o=glue

======================================================================
FAIL: Validating data types.
----------------------------------------------------------------------
Traceback (most recent call last):
  File "/usr/lib/python2.4/site-packages/validator/EntryTest.py", line 60, in test_data_types
    self.assertTrue(check(value), message)
AssertionError: The field GLUE2ComputingShareServingState with value 'testjra1' does not follow the type ServingState_t in GLUE2ShareID=cert_dteam_cream-48.pd.infn.it_ComputingElement,GLUE2ServiceID=cream-48.pd.infn.it_ComputingElement,GLUE2GroupID=resource,o=glue

======================================================================
FAIL: Validating data types.
----------------------------------------------------------------------
Traceback (most recent call last):
  File "/usr/lib/python2.4/site-packages/validator/EntryTest.py", line 60, in test_data_types
    self.assertTrue(check(value), message)
AssertionError: The field GLUE2ComputingShareServingState with value 'testjra1' does not follow the type ServingState_t in GLUE2ShareID=creamtest1_dteam_cream-48.pd.infn.it_ComputingElement,GLUE2ServiceID=cream-48.pd.infn.it_ComputingElement,GLUE2GroupID=resource,o=glue

======================================================================
FAIL: Validating data types.
----------------------------------------------------------------------
Traceback (most recent call last):
  File "/usr/lib/python2.4/site-packages/validator/EntryTest.py", line 60, in test_data_types
    self.assertTrue(check(value), message)
AssertionError: The field GLUE2EndpointCapability with value 'information.publication' does not follow the type Capability_t in GLUE2EndpointID=cream-48.pd.infn.it_ComputingElement_org.glite.ce.ApplicationPublisher_1068561884,GLUE2ServiceID=cream-48.pd.infn.it_ComputingElement,GLUE2GroupID=resource,o=glue

======================================================================
FAIL: Validating data types.
----------------------------------------------------------------------
Traceback (most recent call last):
  File "/usr/lib/python2.4/site-packages/validator/EntryTest.py", line 60, in test_data_types
    self.assertTrue(check(value), message)
AssertionError: The field GLUE2ExecutionEnvironmentPlatform with value 'i686' does not follow the type Platform_t in GLUE2ResourceID=cream-48.pd.infn.it,GLUE2ServiceID=cream-48.pd.infn.it_ComputingElement,GLUE2GroupID=resource,o=glue
 
Changed:
<
<

Glue 2 Compliance

>
>

Ran 156 tests in 0.048s

FAILED (failures=5)

Errors are because of use of a State value not defined in the default glue-validator table.

 

Performance and scalability tests

Revision 92013-02-11 - SergioTraldi

Line: 1 to 1
 
META TOPICPARENT name="EMI2CREAMTask38531"

Testing report: IGIRTC-125

Line: 252 to 252
 

Verification attached bugs for CREAM Torque

Added:
>
>
Bug #99639: lcg-info-dynamic-scheduler-pbs cannot parse qstat output with spurious lines FIXED
[root@cream-40 ~]# qstat -f > testBug99639.txt

Adding some black line

[root@cream-40 ~]# head testBug99639.txt
Job Id: 181.cream-40.pd.infn.it
    Job_Name = crm40_380641998
    Job_Owner = dteam009@cream-40.pd.infn.it
    job_state = Q
    queue = cert
    server = cream-40.pd.infn.it
    
    Checkpoint = u
    ctime = Fri Feb  8 14:09:31 2013
    Error_Path = cream-40.pd.infn.it:/dev/null

Execution command:

[root@cream-40 ~]# /usr/libexec/lcg-info-dynamic-scheduler -c testBug99639.txt

Bug #95184: Missing real value for GlueCEPolicyMaxSlotsPerJob FIXED


[root@cream-40 ~]# qmgr -c "set queue cert resources_max.procct = 4"

[root@cream-40 ~]# /var/lib/bdii/gip/plugin/glite-info-dynamic-ce
dn: GlueCEUniqueID=cream-40.pd.infn.it:8443/cream-lsf-creamtest1,mds-vo-name=resource,o=grid
GlueCEInfoLRMSVersion: 2.5.7
GlueCEInfoTotalCPUs: 8
GlueCEPolicyAssignedJobSlots: 8
....
dn: GlueCEUniqueID=cream-40.pd.infn.it:8443/cream-lsf-cert,mds-vo-name=resource,o=grid
GlueCEInfoLRMSVersion: 2.5.7
GlueCEInfoTotalCPUs: 8
GlueCEPolicyAssignedJobSlots: 8
GlueCEStateFreeCPUs: 8
GlueCEPolicyMaxCPUTime: 2880
GlueCEPolicyMaxObtainableCPUTime: 2880
GlueCEPolicyMaxWallClockTime: 1
GlueCEPolicyMaxObtainableWallClockTime: 72
GlueCEPolicyMaxSlotsPerJob: 4
GlueCEStateStatus: Testing
....

From UI

[traldi@cert-25 ~]$  ldapsearch -x -h cream-40.pd.infn.it -p 2170 -b mds-vo-name=resource,o=grid | grep MaxSlotsPerJob |sort | uniq -c
      1 GlueCEPolicyMaxSlotsPerJob: 4

Bug #96636 Time limits for GLUE 2 are different to GLUE 1 FIXED

[traldi@cert-25 ~]$  ldapsearch -x -H ldap://cream-40.pd.infn.it:2170 -b o=glue '(&(objectclass=GLUE2ComputingShare))' GLUE2ComputingShareMaxCPUTime
....
dn: GLUE2ShareID=cms_ops_cream-40.pd.infn.it_ComputingElement,GLUE2ServiceID=c
 ream-40.pd.infn.it_ComputingElement,GLUE2GroupID=resource,o=glue
GLUE2ComputingShareMaxCPUTime: 172800
...

[traldi@cert-25 ~]$  ldapsearch -x -H ldap://cream-40.pd.infn.it:2170 -b o=glue '(&(objectclass=GLUE2ComputingShare))' GLUE2ComputingShareMaxWallTime
...
# cert_ops_cream-40.pd.infn.it_ComputingElement, cream-40.pd.infn.it_Computin
 gElement, resource, glue
dn: GLUE2ShareID=cert_ops_cream-40.pd.infn.it_ComputingElement,GLUE2ServiceID=
 cream-40.pd.infn.it_ComputingElement,GLUE2GroupID=resource,o=glue
GLUE2ComputingShareMaxWallTime: 4320
...

[traldi@cert-25 ~]$  ldapsearch -x -H ldap://cream-40.pd.infn.it:2170 -b o=glue '(&(objectclass=GLUE2ComputingShare))' GLUE2ComputingShareDefaultCPUTime
...
# cms_ops_cream-40.pd.infn.it_ComputingElement, cream-40.pd.infn.it_Computing
 Element, resource, glue
dn: GLUE2ShareID=cms_ops_cream-40.pd.infn.it_ComputingElement,GLUE2ServiceID=c
 ream-40.pd.infn.it_ComputingElement,GLUE2GroupID=resource,o=glue
GLUE2ComputingShareDefaultCPUTime: 172800
...

[traldi@cert-25 ~]$  ldapsearch -x -H ldap://cream-40.pd.infn.it:2170 -b o=glue '(&(objectclass=GLUE2ComputingShare))' GLUE2ComputingShareDefaultWallTime
....
# cms_ops_cream-40.pd.infn.it_ComputingElement, cream-40.pd.infn.it_Computing
 Element, resource, glue
dn: GLUE2ShareID=cms_ops_cream-40.pd.infn.it_ComputingElement,GLUE2ServiceID=c
 ream-40.pd.infn.it_ComputingElement,GLUE2GroupID=resource,o=glue
GLUE2ComputingShareDefaultWallTime: 4320
...



[traldi@cert-25 ~]$  ldapsearch -x -H ldap://cream-40.pd.infn.it:2170 -b o=grid '(&(objectclass=GLUECE))' GlueCEPolicyMaxCPUTime
...
# cream-40.pd.infn.it:8443/cream-lsf-cms, resource, grid
dn: GlueCEUniqueID=cream-40.pd.infn.it:8443/cream-lsf-cms,Mds-Vo-name=resource
 ,o=grid
GlueCEPolicyMaxCPUTime: 2880
...

[traldi@cert-25 ~]$  ldapsearch -x -H ldap://cream-40.pd.infn.it:2170 -b o=grid '(&(objectclass=GLUECE))' GlueCEPolicyMaxObtainableCPUTime
...
# cream-40.pd.infn.it:8443/cream-lsf-cms, resource, grid
dn: GlueCEUniqueID=cream-40.pd.infn.it:8443/cream-lsf-cms,Mds-Vo-name=resource
 ,o=grid
GlueCEPolicyMaxObtainableCPUTime: 2880
...

[traldi@cert-25 ~]$  ldapsearch -x -H ldap://cream-40.pd.infn.it:2170 -b o=grid '(&(objectclass=GLUECE))' GlueCEPolicyMaxWallClockTime
...
# cream-40.pd.infn.it:8443/cream-lsf-cms, resource, grid
dn: GlueCEUniqueID=cream-40.pd.infn.it:8443/cream-lsf-cms,Mds-Vo-name=resource
 ,o=grid
GlueCEPolicyMaxWallClockTime: 72
...

[traldi@cert-25 ~]$  ldapsearch -x -H ldap://cream-40.pd.infn.it:2170 -b o=grid '(&(objectclass=GLUECE))' GlueCEPolicyMaxObtainableWallClockTime
...
# cream-40.pd.infn.it:8443/cream-lsf-cms, resource, grid
dn: GlueCEUniqueID=cream-40.pd.infn.it:8443/cream-lsf-cms,Mds-Vo-name=resource
 ,o=grid
GlueCEPolicyMaxObtainableWallClockTime: 72
...

 
Bug #99747: glite-info-dynamic-ce does not update GLUE2ComputingShareServingState FIXED
* From UI
Line: 274 to 405
 GLUE2EndpointServingState: draining
Added:
>
>
Bug #93074: CREAM CE/YAIM: add knob to disable SSH key scanning FIXED


[root@cream-40 ~]# egrep -v ^# /opt/glite/yaim/functions/config_torque_submitter_ssh | head -12

config_torque_submitter_ssh_check (){

  requires $1 BATCH_SERVER

}

config_torque_submitter_ssh (){

[ -n "$TORQUE_NO_SSH_KEYSCAN" ] && return

if [ -z "${TORQUE_VAR_DIR}" ]; then
 

Verification attached bugs for CREAM LSF

Bug #99747: glite-info-dynamic-ce does not update GLUE2ComputingShareServingState FIXED

Revision 82013-02-08 - SergioTraldi

Line: 1 to 1
 
META TOPICPARENT name="EMI2CREAMTask38531"

Testing report: IGIRTC-125

Line: 33 to 33
 

Upgrade Installation

CREAM PBS

Changed:
<
<
    • [[][Update log file]]
    • [[][Configuration log file]]
>
>
 

CREAM LSF

Changed:
<
<
    • [[][Update log file]]
    • [[][Configuration log file]]
>
>
 

Unit Tests

Line: 327 to 327
 
META FILEATTACHMENT attachment="task38531_install_cream_pbs_sl5.log" attr="" comment="" date="1359828819" name="task38531_install_cream_pbs_sl5.log" path="task38531_install_cream_pbs_sl5.log" size="136501" user="SaraBertocco" version="1"
META FILEATTACHMENT attachment="functionality_CREAM_SL5_PBS.html.log" attr="" comment="" date="1360057984" name="functionality_CREAM_SL5_PBS.html.log" path="functionality_CREAM_SL5_PBS.html.log" size="536323" user="SaraBertocco" version="2"
META FILEATTACHMENT attachment="functionality_CREAM_SL5_LSF.html.log" attr="" comment="" date="1360081271" name="functionality_CREAM_SL5_LSF.html.log" path="functionality_CREAM_SL5_LSF.html.log" size="540585" user="SaraBertocco" version="1"
Added:
>
>
META FILEATTACHMENT attachment="configuration_update_EMI2_CREAM_LSF_SL5.txt" attr="h" comment="" date="1360337407" name="configuration_update_EMI2_CREAM_LSF_SL5.txt" path="configuration_update_EMI2_CREAM_LSF_SL5.txt" size="91302" user="SergioTraldi" version="1"
META FILEATTACHMENT attachment="configuration_update_EMI2_CREAM_PBS_SL5.txt" attr="h" comment="" date="1360337407" name="configuration_update_EMI2_CREAM_PBS_SL5.txt" path="configuration_update_EMI2_CREAM_PBS_SL5.txt" size="15708" user="SergioTraldi" version="1"
META FILEATTACHMENT attachment="update_EMI2_CREAM_LSF_SL5.txt" attr="h" comment="" date="1360337407" name="update_EMI2_CREAM_LSF_SL5.txt" path="update_EMI2_CREAM_LSF_SL5.txt" size="65388" user="SergioTraldi" version="1"
META FILEATTACHMENT attachment="update_EMI2_CREAM_PBS_SL5.txt" attr="h" comment="" date="1360337407" name="update_EMI2_CREAM_PBS_SL5.txt" path="update_EMI2_CREAM_PBS_SL5.txt" size="66641" user="SergioTraldi" version="1"

Revision 72013-02-07 - SaraBertocco

Line: 1 to 1
 
META TOPICPARENT name="EMI2CREAMTask38531"

Testing report: IGIRTC-125

Line: 260 to 260
 
  • On CE
Changed:
<
<
# /var/lib/bdii/gip/plugin/glite-info-dynamic-ce |grep GLUE2ComputingShareServingState GLUE2ComputingShareServingState: production GLUE2ComputingShareServingState: production GLUE2ComputingShareServingState: production GLUE2ComputingShareServingState: production GLUE2ComputingShareServingState: production GLUE2ComputingShareServingState: production GLUE2ComputingShareServingState: production GLUE2ComputingShareServingState: production
>
>
# /sbin/runuser -s /bin/sh ldap -c "/var/lib/bdii/gip/plugin/glite-info-cream-glue2" |grep ServingState GLUE2EndpointServingState: production
  * From UI
Line: 277 to 270
 
  • On CE
Changed:
<
<
# /var/lib/bdii/gip/plugin/glite-info-dynamic-ce |grep GLUE2ComputingShareServingState GLUE2ComputingShareServingState: draining GLUE2ComputingShareServingState: draining GLUE2ComputingShareServingState: draining GLUE2ComputingShareServingState: draining GLUE2ComputingShareServingState: draining GLUE2ComputingShareServingState: draining GLUE2ComputingShareServingState: draining GLUE2ComputingShareServingState: draining
>
>
# /sbin/runuser -s /bin/sh ldap -c "/var/lib/bdii/gip/plugin/glite-info-cream-glue2" |grep ServingState GLUE2EndpointServingState: draining
 

Verification attached bugs for CREAM LSF

Line: 298 to 284
 
  • On CE
Changed:
<
<
# /var/lib/bdii/gip/plugin/glite-info-dynamic-ce |grep GLUE2ComputingShareServingState GLUE2ComputingShareServingState: draining GLUE2ComputingShareServingState: draining GLUE2ComputingShareServingState: draining
>
>
# /sbin/runuser -s /bin/sh ldap -c "/var/lib/bdii/gip/plugin/glite-info-cream-glue2" |grep ServingState GLUE2EndpointServingState: draining
  * From UI
Line: 310 to 294
 
  • On CE
Changed:
<
<
# /var/lib/bdii/gip/plugin/glite-info-dynamic-ce |grep GLUE2ComputingShareServingState GLUE2ComputingShareServingState: testjra1 GLUE2ComputingShareServingState: testjra1 GLUE2ComputingShareServingState: testjra1
>
>
# /sbin/runuser -s /bin/sh ldap -c "/var/lib/bdii/gip/plugin/glite-info-cream-glue2" |grep ServingState GLUE2EndpointServingState: production
 

Standard conformance tests

Revision 62013-02-05 - SaraBertocco

Line: 1 to 1
 
META TOPICPARENT name="EMI2CREAMTask38531"

Testing report: IGIRTC-125

Line: 54 to 54
 this is the reason why the test "Verify Job Status Output" fails in the lsf version: it is a UI problem.

Authentication using ARGUS in PBS.

Added:
>
>
  • Test "bdii" and "glue" are covered in compliance tests
  • Test "job_man" is excluded because it requires two proxy certificates and the certifier has one only
  • Test "ban user" is failing in pbs because it is not correctly running in argus. The test does in the argus server:
          #  pap-admin un-ban subject "/C=IT/O=INFN/OU=Personal Certificate/L=Padova/CN=Sara Bertocco"
          # /etc/init.d/argus-pepd clearcache
          # /etc/init.d/argus-pdp reloadpolicy
         
    then it tryes a job-submission and it shoul fail, instead it is successful.
  • Test 'old_blah' is excluded because a ssh communication error between ce and ui.

 

Functionality tests

CREAM PBS

Line: 147 to 159
 
  • Functionality testsuite log

CREAM LSF

Added:
>
>
$ pybot  -e bdii -e glue -e job_man -e old_blah  /opt/cream_test/testsuite/cream_test_suite.html 
INFO: The files of this testsuite will be stored under: /tmp/tmppeeI65.cream_testing/
INFO: Non-mandatory variable "sec_cert" has not been set.
INFO: Non-mandatory variable "sec_key" has not been set.
INFO: Non-mandatory variable "argus_host" has not been set.
INFO: Non-mandatory variable "sec_proxy_pass" has not been set.
==============================================================================
Cream Test Suite :: This is the main testing module,needed for testing the ...
==============================================================================
Set Log Level :: Set the log level used for the test suite. This c... | PASS |
------------------------------------------------------------------------------
Check Executables :: Check whether the needed executables for the ... | PASS |
------------------------------------------------------------------------------
Simple Submit :: Execute /bin/uname -a.Submit the jdl and wait for... | PASS |
------------------------------------------------------------------------------
ISB Base URI :: Execute a bash shell script.The script is stored i... | PASS |
------------------------------------------------------------------------------
ISB Client to CE :: Execute a bash shell script.The script is stor... | PASS |
------------------------------------------------------------------------------
ISB gsiftp to CE :: Execute a bash shell script.The script is stor... | PASS |
------------------------------------------------------------------------------
OSB localhost :: Execute /bin/uname -a.Store std out and error str... | PASS |
------------------------------------------------------------------------------
OSB gsiftp BaseDestURI :: Execute /bin/uname -a.Store std out and ... | PASS |
------------------------------------------------------------------------------
OSB gsiftp DestURI :: Execute /bin/uname -a.Store std out and erro... | PASS |
------------------------------------------------------------------------------
Environment :: Execute a bash shell script.The script is stored lo... | PASS |
------------------------------------------------------------------------------
Epilogue :: Execute two bash shell scripts,one for the job and the... | PASS |
------------------------------------------------------------------------------
Prologue :: Execute two bash shell scripts,one for the job and the... | PASS |
------------------------------------------------------------------------------
Explicit Delegation :: Test job submission with explicit delegatio... | PASS |
------------------------------------------------------------------------------
Job Cancel :: Test job cancellation.Two cases are tested:             | PASS |
------------------------------------------------------------------------------
Job List :: Test the job listing cli utility.Store the list of the... | PASS |
------------------------------------------------------------------------------
Job Suspend - Resume :: Submit a job and suspend it.Wait until it'... | PASS |
------------------------------------------------------------------------------
Manually Cancel Job :: Submit a job and then manually cancel it on... | PASS |
------------------------------------------------------------------------------
Verify CE service info :: This test case verifies the output of th... | PASS |
------------------------------------------------------------------------------
Enable - Disable Submission :: This test case tests the proper fun... | PASS |
------------------------------------------------------------------------------
Job Purge :: This test case verifies the proper functionality of t... | PASS |
------------------------------------------------------------------------------
Limiter :: NOTE: This test case is about 25 minutes long!             | PASS |
------------------------------------------------------------------------------
Ban User :: This test case tests if the banning of user works. The... | PASS |
------------------------------------------------------------------------------
Sandbox Staging :: This test case tests the two different Sandbox ... | PASS |
------------------------------------------------------------------------------
Automatic Proxy Purging :: This test case checks the automatic pro... | PASS |
------------------------------------------------------------------------------
Verify Job Status Output :: This test is checking the output of th... | FAIL |
'['https://cream-48.pd.infn.it:8443/CREAM028512789', 'DONE-OK', 'https://cream-48.pd.infn.it:8443/CREAM053966155', 'DONE-OK', 'https://cream-48.pd.infn.it:8443/CREAM070498673', 'DONE-OK', 'https://cream-48.pd.infn.it:8443/CREAM073852060', 'DONE-OK', 'https://cream-48.pd.infn.it:8443/CREAM075843685', 'DONE-OK', 'https://cream-48.pd.infn.it:8443/CREAM076595960', 'DONE-OK', 'https://cream-48.pd.infn.it:8443/CREAM176232679', 'DONE-OK', 'https://cream-48.pd.infn.it:8443/CREAM185807557', 'DONE-OK', 'https://cream-48.pd.infn.it:8443/CREAM196640844', 'DONE-OK', 'https://cream-48.pd.infn.it:8443/CREAM220465714', 'DONE-OK', 'https://cream-48.pd.infn.it:8443/CREAM223251516', 'DONE-FAILED', 'https://cream-48.pd.infn.it:8443/CREAM262719768', 'DONE-OK', 'https://cream-48.pd.infn.it:8443/CREAM388041650', 'DONE-OK', 'https://cream-48.pd.infn.it:8443/CREAM389904579', 'DONE-FAILED', 'https://cream-48.pd.infn.it:8443/CREAM391059930', 'DONE-FAILED', 'https://cream-48.pd.infn.it:8443/CREAM419080879', 'DONE-OK', 'https://cream-48.pd.infn.it:8443/CREAM487916505', 'DONE-FAILED', 'https://cream-48.pd.infn.it:8443/CREAM499449716', 'DONE-OK', 'https://cream-48.pd.infn.it:8443/CREAM509540273', 'DONE-OK', 'https://cream-48.pd.infn.it:8443/CREAM521766039', 'DONE-OK', 'https://cream-48.pd.infn.it:8443/CREAM541142479', 'DONE-OK', 'https://cream-48.pd.infn.it:8443/CREAM542406292', 'DONE-OK', 'https://cream-48.pd.infn.it:8443/CREAM571261194', 'DONE-OK', 'https://cream-48.pd.infn.it:8443/CREAM665174716', 'DONE-OK', 'https://cream-48.pd.infn.it:8443/CREAM667593577', 'DONE-OK', 'https://cream-48.pd.infn.it:8443/CREAM691800694', 'ABORTED', 'https://cream-48.pd.infn.it:8443/CREAM733263594', 'DONE-OK', 'https://cream-48.pd.infn.it:8443/CREAM745902414', 'DONE-OK', 'https://cream-48.pd.infn.it:8443/CREAM763317264', 'DONE-OK', 'https://cream-48.pd.infn.it:8443/CREAM775305199', 'DONE-OK', 'https://cream-48.pd.infn.it:8443/CREAM798608571', 'DONE-OK', 'https://cream-48.pd.infn.it:8443/CREAM801128435', 'CANCELLED', 'https://cream-48.pd.infn.it:8443/CREAM815325178', 'DONE-OK', 'https://cream-48.pd.infn.it:8443/CREAM850827111', 'DONE-OK', 'https://cream-48.pd.infn.it:8443/CREAM860601078', 'DONE-OK', 'https://cream-48.pd.infn.it:8443/CREAM864851068', 'DONE-OK', 'https://cream-48.pd.infn.it:8443/CREAM878965713', 'DONE-OK', 'https://cream-48.pd.infn.it:8443/CREAM899266586', 'DONE-OK']' does not contain 'https://cream-48.pd.infn.it:8443/CREAM272488513'
------------------------------------------------------------------------------
OutputData :: This test case tests the OutputData jdl attribute. T... | PASS |
------------------------------------------------------------------------------
Automatic Job Purge :: This test case is testing the functionality... | PASS |
------------------------------------------------------------------------------
Proxy Renewal :: Submit a job lasting 20 minutes using a proxy val... | PASS |
------------------------------------------------------------------------------
CPU Allocation 1 :: Validate the contents of the batch job submiss... | PASS |
------------------------------------------------------------------------------
CPU Allocation 2 :: Validate the contents of the batch job submiss... | PASS |
------------------------------------------------------------------------------
CPU Allocation 3 :: Validate the contents of the batch job submiss... | PASS |
------------------------------------------------------------------------------
CPU Allocation 4 :: Validate the contents of the batch job submiss... | PASS |
------------------------------------------------------------------------------
CPU Allocation 5 :: Validate the contents of the batch job submiss... | PASS |
------------------------------------------------------------------------------
CPU Allocation 6 :: Validate the contents of the batch job submiss... | PASS |
------------------------------------------------------------------------------
Logging and Bookkeeping :: Check if the logging and bookkeeping se... | PASS |
------------------------------------------------------------------------------
Cream Test Suite :: This is the main testing module,needed for tes... | FAIL |
35 critical tests, 34 passed, 1 failed
35 tests total, 34 passed, 1 failed
==============================================================================
 
Added:
>
>
  • Functionality testsuite log
 

Regression tests

Verification attached bugs for CREAM Torque

Changed:
<
<
Bug # FIXED
>
>
Bug #99747: glite-info-dynamic-ce does not update GLUE2ComputingShareServingState FIXED
* From UI
$ glite-ce-enable-submission cream-06.pd.infn.it:8443
Operation for enabling new submissions succeeded
  • On CE
# /var/lib/bdii/gip/plugin/glite-info-dynamic-ce |grep GLUE2ComputingShareServingState
GLUE2ComputingShareServingState: production
GLUE2ComputingShareServingState: production
GLUE2ComputingShareServingState: production
GLUE2ComputingShareServingState: production
GLUE2ComputingShareServingState: production
GLUE2ComputingShareServingState: production
GLUE2ComputingShareServingState: production
GLUE2ComputingShareServingState: production
* From UI
$ glite-ce-disable-submission cream-06.pd.infn.it:8443
Operation for disabling new submissions succeeded
  • On CE
# /var/lib/bdii/gip/plugin/glite-info-dynamic-ce |grep GLUE2ComputingShareServingState
GLUE2ComputingShareServingState: draining
GLUE2ComputingShareServingState: draining
GLUE2ComputingShareServingState: draining
GLUE2ComputingShareServingState: draining
GLUE2ComputingShareServingState: draining
GLUE2ComputingShareServingState: draining
GLUE2ComputingShareServingState: draining
GLUE2ComputingShareServingState: draining
 

Verification attached bugs for CREAM LSF

Changed:
<
<
Bug #97441: CREAM: Unwanted auto-updating of the field "creationTime" on the creamdb database FIXED
>
>
Bug #99747: glite-info-dynamic-ce does not update GLUE2ComputingShareServingState FIXED
  • From UI
$ glite-ce-disable-submission cream-48.pd.infn.it:8443
Operation for disabling new submissions succeeded
  • On CE
# /var/lib/bdii/gip/plugin/glite-info-dynamic-ce |grep GLUE2ComputingShareServingState
GLUE2ComputingShareServingState: draining
GLUE2ComputingShareServingState: draining
GLUE2ComputingShareServingState: draining
* From UI
$ glite-ce-enable-submission cream-48.pd.infn.it:8443
Operation for enabling new submissions succeeded
  • On CE
# /var/lib/bdii/gip/plugin/glite-info-dynamic-ce |grep GLUE2ComputingShareServingState
GLUE2ComputingShareServingState: testjra1
GLUE2ComputingShareServingState: testjra1
GLUE2ComputingShareServingState: testjra1
 

Standard conformance tests

Glue 1 Compliance

Line: 187 to 344
 
META FILEATTACHMENT attachment="task38531_install_cream_lsf_sl5.log" attr="" comment="" date="1359724781" name="task38531_install_cream_lsf_sl5.log" path="task38531_install_cream_lsf_sl5.log" size="128586" user="SaraBertocco" version="1"
META FILEATTACHMENT attachment="task38531_install_cream_pbs_sl5.log" attr="" comment="" date="1359828819" name="task38531_install_cream_pbs_sl5.log" path="task38531_install_cream_pbs_sl5.log" size="136501" user="SaraBertocco" version="1"
META FILEATTACHMENT attachment="functionality_CREAM_SL5_PBS.html.log" attr="" comment="" date="1360057984" name="functionality_CREAM_SL5_PBS.html.log" path="functionality_CREAM_SL5_PBS.html.log" size="536323" user="SaraBertocco" version="2"
Added:
>
>
META FILEATTACHMENT attachment="functionality_CREAM_SL5_LSF.html.log" attr="" comment="" date="1360081271" name="functionality_CREAM_SL5_LSF.html.log" path="functionality_CREAM_SL5_LSF.html.log" size="540585" user="SaraBertocco" version="1"

Revision 52013-02-05 - SaraBertocco

Line: 1 to 1
 
META TOPICPARENT name="EMI2CREAMTask38531"

Testing report: IGIRTC-125

Line: 59 to 59
 

CREAM PBS

$  pybot  -e bdii -e glue -e job_man -e old_blah /opt/cream_test/testsuite/cream_test_suite.html
Changed:
<
<
INFO: The files of this testsuite will be stored under: /tmp/tmp80JZh7.cream_testing/
>
>
INFO: The files of this testsuite will be stored under: /tmp/tmp1mUltH.cream_testing/
 INFO: Non-mandatory variable "sec_cert" has not been set. INFO: Non-mandatory variable "sec_key" has not been set.
Deleted:
<
<
INFO: Non-mandatory variable "argus_host" has not been set.
 INFO: Non-mandatory variable "sec_proxy_pass" has not been set. INFO: Non-mandatory variable "argus_root_pass" has not been set. ==========================================================================
Line: 187 to 186
 
META FILEATTACHMENT attachment="task38531_install_cream_lsf_sl5.log" attr="" comment="" date="1359724781" name="task38531_install_cream_lsf_sl5.log" path="task38531_install_cream_lsf_sl5.log" size="128586" user="SaraBertocco" version="1"
META FILEATTACHMENT attachment="task38531_install_cream_pbs_sl5.log" attr="" comment="" date="1359828819" name="task38531_install_cream_pbs_sl5.log" path="task38531_install_cream_pbs_sl5.log" size="136501" user="SaraBertocco" version="1"
Changed:
<
<
META FILEATTACHMENT attachment="functionality_CREAM_SL5_PBS.html.log" attr="" comment="" date="1359995348" name="functionality_CREAM_SL5_PBS.html.log" path="functionality_CREAM_SL5_PBS.html.log" size="533909" user="SaraBertocco" version="1"
>
>
META FILEATTACHMENT attachment="functionality_CREAM_SL5_PBS.html.log" attr="" comment="" date="1360057984" name="functionality_CREAM_SL5_PBS.html.log" path="functionality_CREAM_SL5_PBS.html.log" size="536323" user="SaraBertocco" version="2"

Revision 42013-02-04 - SaraBertocco

Line: 1 to 1
 
META TOPICPARENT name="EMI2CREAMTask38531"

Testing report: IGIRTC-125

Line: 58 to 58
 

CREAM PBS

Changed:
<
<
>
>
$ pybot -e bdii -e glue -e job_man -e old_blah /opt/cream_test/testsuite/cream_test_suite.html INFO: The files of this testsuite will be stored under: /tmp/tmp80JZh7.cream_testing/ INFO: Non-mandatory variable "sec_cert" has not been set. INFO: Non-mandatory variable "sec_key" has not been set. INFO: Non-mandatory variable "argus_host" has not been set. INFO: Non-mandatory variable "sec_proxy_pass" has not been set. INFO: Non-mandatory variable "argus_root_pass" has not been set. ========================================================================== Cream Test Suite :: This is the main testing module,needed for testing the ... ========================================================================== Set Log Level :: Set the log level used for the test suite. This c... | PASS |
Check Executables :: Check whether the needed executables for the ... | PASS |
Simple Submit :: Execute /bin/uname -a.Submit the jdl and wait for... | PASS |
ISB Base URI :: Execute a bash shell script.The script is stored i... | PASS |
ISB Client to CE :: Execute a bash shell script.The script is stor... | PASS |
ISB gsiftp to CE :: Execute a bash shell script.The script is stor... | PASS |
OSB localhost :: Execute /bin/uname -a.Store std out and error str... | PASS |
OSB gsiftp BaseDestURI :: Execute /bin/uname -a.Store std out and ... | PASS |
OSB gsiftp DestURI :: Execute /bin/uname -a.Store std out and erro... | PASS |
Environment :: Execute a bash shell script.The script is stored lo... | PASS |
Epilogue :: Execute two bash shell scripts,one for the job and the... | PASS |
Prologue :: Execute two bash shell scripts,one for the job and the... | PASS |
Explicit Delegation :: Test job submission with explicit delegatio... | PASS |
Job Cancel :: Test job cancellation.Two cases are tested: | PASS |
Job List :: Test the job listing cli utility.Store the list of the... | PASS |
Job Suspend - Resume :: Submit a job and suspend it.Wait until it'... | PASS |
Manually Cancel Job :: Submit a job and then manually cancel it on... | PASS |
Verify CE service info :: This test case verifies the output of th... | PASS |
Enable - Disable Submission :: This test case tests the proper fun... | PASS |
Job Purge :: This test case verifies the proper functionality of t... | PASS |
Limiter :: NOTE: This test case is about 25 minutes long! | PASS |
Ban User :: This test case tests if the banning of user works. The... | FAIL | Expected error '*' did not occur
Sandbox Staging :: This test case tests the two different Sandbox ... | PASS |
Automatic Proxy Purging :: This test case checks the automatic pro... | PASS |
Verify Job Status Output :: This test is checking the output of th... | PASS |
OutputData :: This test case tests the OutputData jdl attribute. T... | PASS |
Automatic Job Purge :: This test case is testing the functionality... | PASS |
Proxy Renewal :: Submit a job lasting 20 minutes using a proxy val... | PASS |
CPU Allocation 1 :: Validate the contents of the batch job submiss... | PASS |
CPU Allocation 2 :: Validate the contents of the batch job submiss... | PASS |
CPU Allocation 3 :: Validate the contents of the batch job submiss... | PASS |
CPU Allocation 4 :: Validate the contents of the batch job submiss... | PASS |
CPU Allocation 5 :: Validate the contents of the batch job submiss... | PASS |
CPU Allocation 6 :: Validate the contents of the batch job submiss... | PASS |
Logging and Bookkeeping :: Check if the logging and bookkeeping se... | PASS |
Cream Test Suite :: This is the main testing module,needed for tes... | FAIL | 35 critical tests, 34 passed, 1 failed 35 tests total, 34 passed, 1 failed ==========================================================================
 
Added:
>
>
  • Functionality testsuite log
 

CREAM LSF

Line: 100 to 187
 
META FILEATTACHMENT attachment="task38531_install_cream_lsf_sl5.log" attr="" comment="" date="1359724781" name="task38531_install_cream_lsf_sl5.log" path="task38531_install_cream_lsf_sl5.log" size="128586" user="SaraBertocco" version="1"
META FILEATTACHMENT attachment="task38531_install_cream_pbs_sl5.log" attr="" comment="" date="1359828819" name="task38531_install_cream_pbs_sl5.log" path="task38531_install_cream_pbs_sl5.log" size="136501" user="SaraBertocco" version="1"
Added:
>
>
META FILEATTACHMENT attachment="functionality_CREAM_SL5_PBS.html.log" attr="" comment="" date="1359995348" name="functionality_CREAM_SL5_PBS.html.log" path="functionality_CREAM_SL5_PBS.html.log" size="533909" user="SaraBertocco" version="1"

Revision 32013-02-04 - SaraBertocco

Line: 1 to 1
 
META TOPICPARENT name="EMI2CREAMTask38531"

Testing report: IGIRTC-125

Line: 46 to 46
 

System tests

Added:
>
>
The tests are performed with two different user interfaces:

  • tests of CREAM PBS use UI EMI version 1.11.0-1
  • tests of CREAM LSF use UI EMI version 2.5.1-1

this is the reason why the test "Verify Job Status Output" fails in the lsf version: it is a UI problem.

Authentication using ARGUS in PBS.

 

Functionality tests

CREAM PBS

Added:
>
>
 
Added:
>
>
 

CREAM LSF

Revision 22013-02-02 - SaraBertocco

Line: 1 to 1
 
META TOPICPARENT name="EMI2CREAMTask38531"
Changed:
<
<

Testing report: IGIRTC-91

>
>

Testing report: IGIRTC-125

 

Summary

Changed:
<
<
>
>
 
  • ETICS Subsystem Configuration Name:
  • VCS Tag:
  • EMI Major Release: EMI 2 (Matterhorn)
Line: 23 to 23
 

Clean Installation

CREAM PBS

Changed:
<
<
    • [[][Installation log file]]
    • [[][Configuration log file]]
>
>
 

CREAM LSF

Changed:
<
<
    • [[][Configuration log file]]
>
>
 

Upgrade Installation

Line: 89 to 89
 

META FILEATTACHMENT attachment="task38531_install_cream_lsf_sl5.log" attr="" comment="" date="1359724781" name="task38531_install_cream_lsf_sl5.log" path="task38531_install_cream_lsf_sl5.log" size="128586" user="SaraBertocco" version="1"
Added:
>
>
META FILEATTACHMENT attachment="task38531_install_cream_pbs_sl5.log" attr="" comment="" date="1359828819" name="task38531_install_cream_pbs_sl5.log" path="task38531_install_cream_pbs_sl5.log" size="136501" user="SaraBertocco" version="1"

Revision 12013-02-01 - SaraBertocco

Line: 1 to 1
Added:
>
>
META TOPICPARENT name="EMI2CREAMTask38531"

Testing report: IGIRTC-91

Summary

  • Product: CREAM v. 1.14.1
  • Release Task: Task #38531
  • ETICS Subsystem Configuration Name:
  • VCS Tag:
  • EMI Major Release: EMI 2 (Matterhorn)
  • Platform: SL5 epel
  • Author: Sara Bertocco
  • Testing report: [[][Testing Report file]]
  • Certification report: [[][Certification Report file]]
  • Outcome: "In Certification*

Deployment tests

Clean Installation

CREAM PBS

    • [[][Installation log file]]
    • [[][Configuration log file]]

CREAM LSF

Upgrade Installation

CREAM PBS

    • [[][Update log file]]
    • [[][Configuration log file]]

CREAM LSF

    • [[][Update log file]]
    • [[][Configuration log file]]

Unit Tests

System tests

Functionality tests

CREAM PBS

CREAM LSF

Regression tests

Verification attached bugs for CREAM Torque

Bug # FIXED

Verification attached bugs for CREAM LSF

Bug #97441: CREAM: Unwanted auto-updating of the field "creationTime" on the creamdb database FIXED

Standard conformance tests

Glue 1 Compliance

  • glue-validator -t glue1 -h cert-41.pd.infn.it -p 2170 -b o=grid 
    log

Glue 2 Compliance

Performance and scalability tests

Integration testing

Tests described:

-- SaraBertocco - 2013-02-01

META FILEATTACHMENT attachment="task38531_install_cream_lsf_sl5.log" attr="" comment="" date="1359724781" name="task38531_install_cream_lsf_sl5.log" path="task38531_install_cream_lsf_sl5.log" size="128586" user="SaraBertocco" version="1"
 
This site is powered by the TWiki collaboration platformCopyright © 2008-2019 by the contributing authors. All material on this collaboration platform is the property of the contributing authors.
Ideas, requests, problems regarding TWiki? Send feedback