Difference: EMI2CREAMTask38531SL5 (10 vs. 11)

Revision 112013-02-17 - CristinaAiftimiei

Line: 1 to 1
 
META TOPICPARENT name="EMI2CREAMTask38531"

CREAM v. 1.14.3 (family) - Testing report SL5: IGIRTC-125

Line: 448 to 448
 

Standard conformance tests

Changed:
<
<

Glue 1 Compliance

  • glue-validator -t glue1 -h cert-41.pd.infn.it -p 2170 -b o=grid 
    log
>
>

Glue 1 Compliance - PASSED

  • [root@cream-48 ~]# glue-validator -t glue1 -h cream-48.pd.infn.it -p 2170 -b o=grid
    Validating data types. ... ok
    Verifying the existence of mandatory attributes. ... ok
    Verifying the object class ... ok
    Verifying single-valued attributes only have one value. ... ok
    Validating data types. ... ok
    Verifying the existence of mandatory attributes. ... ok
    Verifying the object class ... ok
    Verifying single-valued attributes only have one value. ... ok
    Validating data types. ... ok
    Verifying the existence of mandatory attributes. ... ok
    Verifying the object class ... ok
    Verifying single-valued attributes only have one value. ... ok
    Validating data types. ... ok
    Verifying the existence of mandatory attributes. ... ok
    Verifying the object class ... ok
    Verifying single-valued attributes only have one value. ... ok
    Validating data types. ... ok
    Verifying the existence of mandatory attributes. ... ok
    Verifying the object class ... ok
    Verifying single-valued attributes only have one value. ... ok
    Validating data types. ... ok
    Verifying the existence of mandatory attributes. ... ok
    Verifying the object class ... ok
    Verifying single-valued attributes only have one value. ... ok
    Validating data types. ... ok
    Verifying the existence of mandatory attributes. ... ok
    Verifying the object class ... ok
    Verifying single-valued attributes only have one value. ... ok
    Validating data types. ... ok
    Verifying the existence of mandatory attributes. ... ok
    Verifying the object class ... ok
    Verifying single-valued attributes only have one value. ... ok
    Validating data types. ... ok
    Verifying the existence of mandatory attributes. ... ok
    Verifying the object class ... ok
    Verifying single-valued attributes only have one value. ... ok
    Validating data types. ... ok
    Verifying the existence of mandatory attributes. ... ok
    Verifying the object class ... ok
    Verifying single-valued attributes only have one value. ... ok
    Validating data types. ... ok
    Verifying the existence of mandatory attributes. ... ok
    Verifying the object class ... ok
    Verifying single-valued attributes only have one value. ... ok
    Validating data types. ... ok
    Verifying the existence of mandatory attributes. ... ok
    Verifying the object class ... ok
    Verifying single-valued attributes only have one value. ... ok
    Validating data types. ... ok
    Verifying the existence of mandatory attributes. ... ok
    Verifying the object class ... ok
    Verifying single-valued attributes only have one value. ... ok
    Validating data types. ... ok
    Verifying the existence of mandatory attributes. ... ok
    Verifying the object class ... ok
    Verifying single-valued attributes only have one value. ... ok
    Validating data types. ... ok
    Verifying the existence of mandatory attributes. ... ok
    Verifying the object class ... ok
    Verifying single-valued attributes only have one value. ... ok
    Validating data types. ... ok
    Verifying the existence of mandatory attributes. ... ok
    Verifying the object class ... ok
    Verifying single-valued attributes only have one value. ... ok
    Validating data types. ... ok
    Verifying the existence of mandatory attributes. ... ok
    Verifying the object class ... ok
    Verifying single-valued attributes only have one value. ... ok
    Validating data types. ... ok
    Verifying the existence of mandatory attributes. ... ok
    Verifying the object class ... ok
    Verifying single-valued attributes only have one value. ... ok
    Validating data types. ... ok
    Verifying the existence of mandatory attributes. ... ok
    Verifying the object class ... ok
    Verifying single-valued attributes only have one value. ... ok
    Validating data types. ... ok
    Verifying the existence of mandatory attributes. ... ok
    Verifying the object class ... ok
    Verifying single-valued attributes only have one value. ... ok
    Validating data types. ... ok
    Verifying the existence of mandatory attributes. ... ok
    Verifying the object class ... ok
    Verifying single-valued attributes only have one value. ... ok
    Validating data types. ... ok
    Verifying the existence of mandatory attributes. ... ok
    Verifying the object class ... ok
    Verifying single-valued attributes only have one value. ... ok
    Validating data types. ... ok
    Verifying the existence of mandatory attributes. ... ok
    Verifying the object class ... ok
    Verifying single-valued attributes only have one value. ... ok
    Validating data types. ... ok
    Verifying the existence of mandatory attributes. ... ok
    Verifying the object class ... ok
    Verifying single-valued attributes only have one value. ... ok
    Validating data types. ... ok
    Verifying the existence of mandatory attributes. ... ok
    Verifying the object class ... ok
    Verifying single-valued attributes only have one value. ... ok
    
    ----------------------------------------------------------------------
    Ran 100 tests in 0.024s
    
    OK

Glue 2 Compliance - PASSED

[root@cream-48 ~]# glue-validator -t glue2 -h cream-48.pd.infn.it -p 2170 -b o=glue
Validating data types. ... ok
Verifying the existence of mandatory attributes. ... ok
Verifying the object class ... ok
Verifying single-valued attributes only have one value. ... ok
Validating data types. ... ok
Verifying the existence of mandatory attributes. ... ok
Verifying the object class ... ok
Verifying single-valued attributes only have one value. ... ok
Validating data types. ... ok
Verifying the existence of mandatory attributes. ... ok
Verifying the object class ... ok
Verifying single-valued attributes only have one value. ... ok
Validating data types. ... ok
Verifying the existence of mandatory attributes. ... ok
Verifying the object class ... ok
Verifying single-valued attributes only have one value. ... ok
Validating data types. ... ok
Verifying the existence of mandatory attributes. ... ok
Verifying the object class ... ok
Verifying single-valued attributes only have one value. ... ok
Validating data types. ... ok
Verifying the existence of mandatory attributes. ... ok
Verifying the object class ... ok
Verifying single-valued attributes only have one value. ... ok
Validating data types. ... FAIL
Verifying the existence of mandatory attributes. ... ok
Verifying the object class ... ok
Verifying single-valued attributes only have one value. ... ok
Validating data types. ... ok
Verifying the existence of mandatory attributes. ... ok
Verifying the object class ... ok
Verifying single-valued attributes only have one value. ... ok
Validating data types. ... ok
Verifying the existence of mandatory attributes. ... ok
Verifying the object class ... ok
Verifying single-valued attributes only have one value. ... ok
Validating data types. ... ok
Verifying the existence of mandatory attributes. ... ok
Verifying the object class ... ok
Verifying single-valued attributes only have one value. ... ok
Validating data types. ... ok
Verifying the existence of mandatory attributes. ... ok
Verifying the object class ... ok
Verifying single-valued attributes only have one value. ... ok
Validating data types. ... ok
Verifying the existence of mandatory attributes. ... ok
Verifying the object class ... ok
Verifying single-valued attributes only have one value. ... ok
Validating data types. ... ok
Verifying the existence of mandatory attributes. ... ok
Verifying the object class ... ok
Verifying single-valued attributes only have one value. ... ok
Validating data types. ... ok
Verifying the existence of mandatory attributes. ... ok
Verifying the object class ... ok
Verifying single-valued attributes only have one value. ... ok
Validating data types. ... ok
Verifying the existence of mandatory attributes. ... ok
Verifying the object class ... ok
Verifying single-valued attributes only have one value. ... ok
Validating data types. ... ok
Verifying the existence of mandatory attributes. ... ok
Verifying the object class ... ok
Verifying single-valued attributes only have one value. ... ok
Validating data types. ... FAIL
Verifying the existence of mandatory attributes. ... ok
Verifying the object class ... ok
Verifying single-valued attributes only have one value. ... ok
Validating data types. ... FAIL
Verifying the existence of mandatory attributes. ... ok
Verifying the object class ... ok
Verifying single-valued attributes only have one value. ... ok
Validating data types. ... ok
Verifying the existence of mandatory attributes. ... ok
Verifying the object class ... ok
Verifying single-valued attributes only have one value. ... ok
Validating data types. ... ok
Verifying the existence of mandatory attributes. ... ok
Verifying the object class ... ok
Verifying single-valued attributes only have one value. ... ok
Validating data types. ... FAIL
Verifying the existence of mandatory attributes. ... ok
Verifying the object class ... ok
Verifying single-valued attributes only have one value. ... ok
Validating data types. ... ok
Verifying the existence of mandatory attributes. ... ok
Verifying the object class ... ok
Verifying single-valued attributes only have one value. ... ok
Validating data types. ... FAIL
Verifying the existence of mandatory attributes. ... ok
Verifying the object class ... ok
Verifying single-valued attributes only have one value. ... ok
Validating data types. ... ok
Verifying the existence of mandatory attributes. ... ok
Verifying the object class ... ok
Verifying single-valued attributes only have one value. ... ok
Validating data types. ... ok
Verifying the existence of mandatory attributes. ... ok
Verifying the object class ... ok
Verifying single-valued attributes only have one value. ... ok
Validating data types. ... ok
Verifying the existence of mandatory attributes. ... ok
Verifying the object class ... ok
Verifying single-valued attributes only have one value. ... ok
Validating data types. ... ok
Verifying the existence of mandatory attributes. ... ok
Verifying the object class ... ok
Verifying single-valued attributes only have one value. ... ok
Validating data types. ... ok
Verifying the existence of mandatory attributes. ... ok
Verifying the object class ... ok
Verifying single-valued attributes only have one value. ... ok
Validating data types. ... ok
Verifying the existence of mandatory attributes. ... ok
Verifying the object class ... ok
Verifying single-valued attributes only have one value. ... ok
Validating data types. ... ok
Verifying the existence of mandatory attributes. ... ok
Verifying the object class ... ok
Verifying single-valued attributes only have one value. ... ok
Validating data types. ... ok
Verifying the existence of mandatory attributes. ... ok
Verifying the object class ... ok
Verifying single-valued attributes only have one value. ... ok
Validating data types. ... ok
Verifying the existence of mandatory attributes. ... ok
Verifying the object class ... ok
Verifying single-valued attributes only have one value. ... ok
Validating data types. ... ok
Verifying the existence of mandatory attributes. ... ok
Verifying the object class ... ok
Verifying single-valued attributes only have one value. ... ok
Validating data types. ... ok
Verifying the existence of mandatory attributes. ... ok
Verifying the object class ... ok
Verifying single-valued attributes only have one value. ... ok
Validating data types. ... ok
Verifying the existence of mandatory attributes. ... ok
Verifying the object class ... ok
Verifying single-valued attributes only have one value. ... ok
Validating data types. ... ok
Verifying the existence of mandatory attributes. ... ok
Verifying the object class ... ok
Verifying single-valued attributes only have one value. ... ok
Validating data types. ... ok
Verifying the existence of mandatory attributes. ... ok
Verifying the object class ... ok
Verifying single-valued attributes only have one value. ... ok
Validating data types. ... ok
Verifying the existence of mandatory attributes. ... ok
Verifying the object class ... ok
Verifying single-valued attributes only have one value. ... ok
Validating data types. ... ok
Verifying the existence of mandatory attributes. ... ok
Verifying the object class ... ok
Verifying single-valued attributes only have one value. ... ok

======================================================================
FAIL: Validating data types.
----------------------------------------------------------------------
Traceback (most recent call last):
  File "/usr/lib/python2.4/site-packages/validator/EntryTest.py", line 60, in test_data_types
    self.assertTrue(check(value), message)
AssertionError: The field GLUE2ComputingShareServingState with value 'testjra1' does not follow the type ServingState_t in GLUE2ShareID=creamtest2_dteam_cream-48.pd.infn.it_ComputingElement,GLUE2ServiceID=cream-48.pd.infn.it_ComputingElement,GLUE2GroupID=resource,o=glue

======================================================================
FAIL: Validating data types.
----------------------------------------------------------------------
Traceback (most recent call last):
  File "/usr/lib/python2.4/site-packages/validator/EntryTest.py", line 60, in test_data_types
    self.assertTrue(check(value), message)
AssertionError: The field GLUE2ComputingShareServingState with value 'testjra1' does not follow the type ServingState_t in GLUE2ShareID=cert_dteam_cream-48.pd.infn.it_ComputingElement,GLUE2ServiceID=cream-48.pd.infn.it_ComputingElement,GLUE2GroupID=resource,o=glue

======================================================================
FAIL: Validating data types.
----------------------------------------------------------------------
Traceback (most recent call last):
  File "/usr/lib/python2.4/site-packages/validator/EntryTest.py", line 60, in test_data_types
    self.assertTrue(check(value), message)
AssertionError: The field GLUE2ComputingShareServingState with value 'testjra1' does not follow the type ServingState_t in GLUE2ShareID=creamtest1_dteam_cream-48.pd.infn.it_ComputingElement,GLUE2ServiceID=cream-48.pd.infn.it_ComputingElement,GLUE2GroupID=resource,o=glue

======================================================================
FAIL: Validating data types.
----------------------------------------------------------------------
Traceback (most recent call last):
  File "/usr/lib/python2.4/site-packages/validator/EntryTest.py", line 60, in test_data_types
    self.assertTrue(check(value), message)
AssertionError: The field GLUE2EndpointCapability with value 'information.publication' does not follow the type Capability_t in GLUE2EndpointID=cream-48.pd.infn.it_ComputingElement_org.glite.ce.ApplicationPublisher_1068561884,GLUE2ServiceID=cream-48.pd.infn.it_ComputingElement,GLUE2GroupID=resource,o=glue

======================================================================
FAIL: Validating data types.
----------------------------------------------------------------------
Traceback (most recent call last):
  File "/usr/lib/python2.4/site-packages/validator/EntryTest.py", line 60, in test_data_types
    self.assertTrue(check(value), message)
AssertionError: The field GLUE2ExecutionEnvironmentPlatform with value 'i686' does not follow the type Platform_t in GLUE2ResourceID=cream-48.pd.infn.it,GLUE2ServiceID=cream-48.pd.infn.it_ComputingElement,GLUE2GroupID=resource,o=glue
 
Changed:
<
<

Glue 2 Compliance

>
>

Ran 156 tests in 0.048s

FAILED (failures=5)

Errors are because of use of a State value not defined in the default glue-validator table.

 

Performance and scalability tests

 
This site is powered by the TWiki collaboration platformCopyright © 2008-2019 by the contributing authors. All material on this collaboration platform is the property of the contributing authors.
Ideas, requests, problems regarding TWiki? Send feedback