Difference: EMI2VomsTask34093 (1 vs. 8)

Revision 82012-11-21 - CristinaAiftimiei

Line: 1 to 1
 

Testing report: IGIRTC-117

Line: 12 to 12
 
  • EMI Major Release: EMI 2 (Matterhorn)
  • Platform: SL5/x86_64, SL6/x86_64, Debian
  • Author: Sergio Traldi
Changed:
<
<
>
>
 

Deployment tests

Line: 313 to 313
 

Integration testing

Deleted:
<
<
-- SergioTraldi - 2012-11-14
 
META FILEATTACHMENT attachment="updateSL5_EMI2_voms.txt" attr="h" comment="" date="1352909148" name="updateSL5_EMI2_voms.txt" path="updateSL5_EMI2_voms.txt" size="7089" user="SergioTraldi" version="1"
META FILEATTACHMENT attachment="updateSL6_EMI2_voms.txt" attr="h" comment="" date="1352909148" name="updateSL6_EMI2_voms.txt" path="updateSL6_EMI2_voms.txt" size="71421" user="SergioTraldi" version="1"
META FILEATTACHMENT attachment="configurationSL5_EM2_voms.txt" attr="h" comment="" date="1352909148" name="configurationSL5_EM2_voms.txt" path="configurationSL5_EM2_voms.txt" size="15943" user="SergioTraldi" version="1"
Line: 326 to 324
 
META FILEATTACHMENT attachment="clean_configurationSL5_EMI2_voms.txt" attr="h" comment="" date="1353495853" name="clean_configurationSL5_EMI2_voms.txt" path="clean_configurationSL5_EMI2_voms.txt" size="28197" user="SergioTraldi" version="1"
META FILEATTACHMENT attachment="clean_configurationDebian_EMI2_vomsApi.txt" attr="" comment="" date="1353495965" name="clean_configurationDebian_EMI2_vomsApi.txt" path="clean_configurationDebian_EMI2_vomsApi.txt" size="3420" user="SergioTraldi" version="1"
META FILEATTACHMENT attachment="clean_install_log_Debian_vomsApi.txt" attr="" comment="" date="1353495965" name="clean_install_log_Debian_vomsApi.txt" path="clean_install_log_Debian_vomsApi.txt" size="7914" user="SergioTraldi" version="1"
Added:
>
>
META FILEATTACHMENT attachment="EMI_test_report_voms_34093.txt" attr="" comment="Test & Cert reports" date="1353511258" name="EMI_test_report_voms_34093.txt" path="EMI_test_report_voms_34093.txt" size="2757" user="CristinaAiftimiei" version="1"
META FILEATTACHMENT attachment="EMI_cert_report_voms_34093.txt" attr="" comment="Test & Cert reports" date="1353511258" name="EMI_cert_report_voms_34093.txt" path="EMI_cert_report_voms_34093.txt" size="2582" user="CristinaAiftimiei" version="1"

Revision 62012-11-21 - SergioTraldi

Line: 1 to 1
 

Testing report: IGIRTC-117

Line: 23 to 23
 

VOMS mysql

  • SL5:
Changed:
<
<
>
>
 
Changed:
<
<
>
>
 

Upgrade Installation

Line: 319 to 319
 
META FILEATTACHMENT attachment="full_result-cert-30" attr="h" comment="" date="1352909148" name="full_result-cert-30" path="full_result-cert-30" size="15388" user="SergioTraldi" version="1"
META FILEATTACHMENT attachment="full_result-cert-25.tgz" attr="h" comment="" date="1353072503" name="full_result-cert-25.tgz" path="full_result-cert-25.tgz" size="109714" user="SergioTraldi" version="1"
META FILEATTACHMENT attachment="full_result-emitestbed18" attr="h" comment="" date="1353072503" name="full_result-emitestbed18" path="full_result-emitestbed18" size="15282" user="SergioTraldi" version="1"
Added:
>
>
META FILEATTACHMENT attachment="clean_installSL5_EMI2_voms.txt" attr="h" comment="" date="1353495853" name="clean_installSL5_EMI2_voms.txt" path="clean_installSL5_EMI2_voms.txt" size="95597" user="SergioTraldi" version="1"
META FILEATTACHMENT attachment="clean_configurationSL5_EMI2_voms.txt" attr="h" comment="" date="1353495853" name="clean_configurationSL5_EMI2_voms.txt" path="clean_configurationSL5_EMI2_voms.txt" size="28197" user="SergioTraldi" version="1"
META FILEATTACHMENT attachment="clean_configurationDebian_EMI2_vomsApi.txt" attr="" comment="" date="1353495965" name="clean_configurationDebian_EMI2_vomsApi.txt" path="clean_configurationDebian_EMI2_vomsApi.txt" size="3420" user="SergioTraldi" version="1"
META FILEATTACHMENT attachment="clean_install_log_Debian_vomsApi.txt" attr="" comment="" date="1353495965" name="clean_install_log_Debian_vomsApi.txt" path="clean_install_log_Debian_vomsApi.txt" size="7914" user="SergioTraldi" version="1"

Revision 52012-11-21 - CristinaAiftimiei

Line: 1 to 1
 

Testing report: IGIRTC-117

Summary

Changed:
<
<
  • Product: VOMS api c++ & Java v. 2.0.9-1
>
>
  • Product: VOMS v. 2.0.9-1
 
  • Release Task: Task #34093
  • ETICS Subsystem Configuration Name:
  • VCS Tag:
  • EMI Major Release: EMI 2 (Matterhorn)
Changed:
<
<
  • Platform: SL5 epel, SL6 epel, Debian
>
>
  • Platform: SL5/x86_64, SL6/x86_64, Debian
 
Line: 44 to 44
 

Unit Tests

Added:
>
>
Continuosly running unit test results are available HERE
 

System tests

Functionality tests

Line: 184 to 186
  * detailed results of Regression tests PASSED
Changed:
<
<

Standard Conformance Tests

>
>

Standard Conformance Tests

Glue 1 Compliance

Result: PASSED

[caifti@emitestbed18 ~]$ glue-validator -t glue1 -h emitestbed18.cnaf.infn.it -p 2170 -b o=grid
Validating data types. ... ok
Verifying the existence of mandatory attributes. ... ok
Verifying the object class ... ok
Verifying single-valued attributes only have one value. ... ok
Validating data types. ... ok
Verifying the existence of mandatory attributes. ... ok
Verifying the object class ... ok
Verifying single-valued attributes only have one value. ... ok
Validating data types. ... ok
Verifying the existence of mandatory attributes. ... ok
Verifying the object class ... ok
Verifying single-valued attributes only have one value. ... ok
Validating data types. ... ok
Verifying the existence of mandatory attributes. ... ok
Verifying the object class ... ok
Verifying single-valued attributes only have one value. ... ok
Validating data types. ... ok
Verifying the existence of mandatory attributes. ... ok
Verifying the object class ... ok
Verifying single-valued attributes only have one value. ... ok
Validating data types. ... ok
Verifying the existence of mandatory attributes. ... ok
Verifying the object class ... ok
Verifying single-valued attributes only have one value. ... ok
Validating data types. ... ok
Verifying the existence of mandatory attributes. ... ok
Verifying the object class ... ok
Verifying single-valued attributes only have one value. ... ok
Validating data types. ... ok
Verifying the existence of mandatory attributes. ... ok
Verifying the object class ... ok
Verifying single-valued attributes only have one value. ... ok
Validating data types. ... FAIL
Verifying the existence of mandatory attributes. ... ok
Verifying the object class ... ok
Verifying single-valued attributes only have one value. ... ok
Validating data types. ... ok
Verifying the existence of mandatory attributes. ... ok
Verifying the object class ... ok
Verifying single-valued attributes only have one value. ... ok

======================================================================
FAIL: Validating data types.
----------------------------------------------------------------------
Traceback (most recent call last):
  File "/usr/lib/python2.4/site-packages/validator/EntryTest.py", line 60, in test_data_types
    self.assertTrue(check(value), message)
AssertionError: The field GlueServiceEndpoint with value 'voms://emitestbed18.cnaf.infn.it:15000/cert.mysql' does not follow the type URL in GlueServiceUniqueID=emitestbed18.cnaf.infn.it_org.glite.voms_2619629021_cert.mysql,Mds-Vo-name=resource,o=grid

----------------------------------------------------------------------
Ran 40 tests in 0.141s

FAILED (failures=1)

  • reported error is on glue-validator side and is been addressed by glue-validator maintainers

Glue 2 Compliance

Result: PASSED

[caifti@emitestbed18 ~]$ glue-validator -t glue2 -h emitestbed18.cnaf.infn.it -p 2170 -b o=glue
Validating data types. ... ok
Verifying the existence of mandatory attributes. ... ok
Verifying the object class ... ok
Verifying single-valued attributes only have one value. ... ok
Validating data types. ... ok
Verifying the existence of mandatory attributes. ... ok
Verifying the object class ... ok
Verifying single-valued attributes only have one value. ... ok
Validating data types. ... ok
Verifying the existence of mandatory attributes. ... ok
Verifying the object class ... ok
Verifying single-valued attributes only have one value. ... ok
Validating data types. ... ok
Verifying the existence of mandatory attributes. ... ok
Verifying the object class ... ok
Verifying single-valued attributes only have one value. ... ok
Validating data types. ... ok
Verifying the existence of mandatory attributes. ... ok
Verifying the object class ... ok
Verifying single-valued attributes only have one value. ... ok
Validating data types. ... ok
Verifying the existence of mandatory attributes. ... ok
Verifying the object class ... ok
Verifying single-valued attributes only have one value. ... ok
Validating data types. ... ok
Verifying the existence of mandatory attributes. ... ok
Verifying the object class ... ok
Verifying single-valued attributes only have one value. ... ok
Validating data types. ... FAIL
Verifying the existence of mandatory attributes. ... ok
Verifying the object class ... ok
Verifying single-valued attributes only have one value. ... ok

======================================================================
FAIL: Validating data types.
----------------------------------------------------------------------
Traceback (most recent call last):
  File "/usr/lib/python2.4/site-packages/validator/EntryTest.py", line 60, in test_data_types
    self.assertTrue(check(value), message)
AssertionError: The field GLUE2EndpointURL with value 'voms://emitestbed18.cnaf.infn.it:15000/cert.mysql' does not follow the type URL in GLUE2EndpointID=emitestbed18.cnaf.infn.it_VOMS_257915444_voms_257915444_cert.mysql,GLUE2ServiceID=emitestbed18.cnaf.infn.it_VOMS_257915444,GLUE2GroupID=resource,o=glue

----------------------------------------------------------------------
Ran 32 tests in 0.123s

FAILED (failures=1)
 
Added:
>
>
  • reported error is on glue-validator side and is been addressed by glue-validator maintainers
 

Integration testing

Revision 42012-11-16 - SergioTraldi

Line: 1 to 1
 

Testing report: IGIRTC-117

Line: 48 to 48
 

Functionality tests

Changed:
<
<

SL5:

>
>

VOMS ADMIN

SL5:
  Checked that the VOMS Admin web application is running, from a browser :
Line: 57 to 59
  Browser Test: PASSED
Changed:
<
<

SL6:

>
>
[traldi@emitestbed18 cli-testsuite]$ ./myCheck-VOMS -n emitestbed18.cnaf.infn.it -l test-sequence.lst.voms-admin
emitestbed18.cnaf.infn.it
test-sequence.lst.voms-admin
Test for emitestbed18.cnaf.infn.it: started
...
Short report:
Test VOMS-addMember     - OK
Test VOMS-assignRole    - OK
Test VOMS-crAttribute   - OK
Test VOMS-crGroup       - OK
Test VOMS-crRole        - OK
Test VOMS-crUser        - OK
Test VOMS-crUserNocert  - OK
Test VOMS-delAttribute  - OK
Test VOMS-delGroup      - OK
Test VOMS-delGroupAttribute     - OK
Test VOMS-delRole       - OK
Test VOMS-delRoleAttribute      - OK
Test VOMS-delUser       - OK
Test VOMS-delUserAttribute      - OK
Test VOMS-dismissRole   - OK
Test VOMS-listAttributes has failed
Test VOMS-listGroupAttributes   - OK
Test VOMS-listGroups    - OK
Test VOMS-listMembers   - OK
Test VOMS-listRoleAttributes    - OK
Test VOMS-listRoles     - OK
Test VOMS-listSubGroups - OK
Test VOMS-listUserAttributes    - OK
Test VOMS-listUserGroups        - OK
Test VOMS-listUserRoles - OK
Test VOMS-listUsers     - OK
Test VOMS-listUsrWithRol        - OK
Test VOMS-removeMember  - OK
Test VOMS-setGroupAttribute     - OK
Test VOMS-setRoleAttribute      - OK
Test VOMS-setUserAttribute      - OK
Full test report exists in ./full_result

SL6:
  Checked that the VOMS Admin web application is running, from a browser :
Line: 109 to 154
 
Added:
>
>

VOMS core

 

Regression tests

Line: 150 to 197
 
META FILEATTACHMENT attachment="configurationSL5_EM2_voms.txt" attr="h" comment="" date="1352909148" name="configurationSL5_EM2_voms.txt" path="configurationSL5_EM2_voms.txt" size="15943" user="SergioTraldi" version="1"
META FILEATTACHMENT attachment="configurationSL6_EM2_voms.txt" attr="h" comment="" date="1352909148" name="configurationSL6_EM2_voms.txt" path="configurationSL6_EM2_voms.txt" size="18832" user="SergioTraldi" version="1"
META FILEATTACHMENT attachment="full_result-cert-30" attr="h" comment="" date="1352909148" name="full_result-cert-30" path="full_result-cert-30" size="15388" user="SergioTraldi" version="1"
Added:
>
>
META FILEATTACHMENT attachment="full_result-cert-25.tgz" attr="h" comment="" date="1353072503" name="full_result-cert-25.tgz" path="full_result-cert-25.tgz" size="109714" user="SergioTraldi" version="1"
META FILEATTACHMENT attachment="full_result-emitestbed18" attr="h" comment="" date="1353072503" name="full_result-emitestbed18" path="full_result-emitestbed18" size="15282" user="SergioTraldi" version="1"

Revision 32012-11-16 - SergioTraldi

Line: 1 to 1
 

Testing report: IGIRTC-117

Line: 112 to 112
 

Regression tests

Added:
>
>
[traldi@cert-25 voms-testsuite]$ pybot --variable certsDir:/usr/share/igi-test-ca regression==============================================================================
Regression                                                                    
==============================================================================
Regression.Key-Usage-Handling :: A set of regression tests for bug https://...
==============================================================================
Voms proxy init correctly handles missing keygen extension in cert... | PASS |
------------------------------------------------------------------------------
Voms proxy init correctly handles present keygen extension in cert... | PASS |
------------------------------------------------------------------------------
Regression.Key-Usage-Handling :: A set of regression tests for bug... | PASS |
2 critical tests, 2 passed, 0 failed
2 tests total, 2 passed, 0 failed
==============================================================================
Regression                                                            | PASS |
2 critical tests, 2 passed, 0 failed
2 tests total, 2 passed, 0 failed
==============================================================================
Output:  /home/traldi/voms-regression/voms-testsuite/output.xml
Log:     /home/traldi/voms-regression/voms-testsuite/log.html
Report:  /home/traldi/voms-regression/voms-testsuite/report.html

* detailed results of Regression tests PASSED

 

Standard Conformance Tests

Revision 22012-11-14 - SergioTraldi

Line: 1 to 1
 

Testing report: IGIRTC-117

Line: 26 to 26
 
Added:
>
>
 

Upgrade Installation

VOMS mysql

  • SL5:
Changed:
<
<
>
>

 

Unit Tests

Line: 40 to 48
 

Functionality tests

Changed:
<
<
>
>

SL5:

Checked that the VOMS Admin web application is running, from a browser :

Browser Test: PASSED

SL6:

Checked that the VOMS Admin web application is running, from a browser :

Browser Test: PASSED

[traldi@cert-30 cli-testsuite]$ ./myCheck-VOMS -n cert-30.cnaf.infn.it -l test-sequence.lst.voms-admin 
cert-30.cnaf.infn.it
test-sequence.lst.voms-admin
Test for cert-30.cnaf.infn.it: started
...
Short report:
Test VOMS-addMember     - OK
Test VOMS-assignRole    - OK
Test VOMS-crAttribute   - OK
Test VOMS-crGroup       - OK
Test VOMS-crRole        - OK
Test VOMS-crUser        - OK
Test VOMS-crUserNocert  - OK
Test VOMS-delAttribute  - OK
Test VOMS-delGroup      - OK
Test VOMS-delGroupAttribute     - OK
Test VOMS-delRole       - OK
Test VOMS-delRoleAttribute      - OK
Test VOMS-delUser       - OK
Test VOMS-delUserAttribute      - OK
Test VOMS-dismissRole   - OK
Test VOMS-listAttributes        - OK
Test VOMS-listGroupAttributes   - OK
Test VOMS-listGroups    - OK
Test VOMS-listMembers   - OK
Test VOMS-listRoleAttributes    - OK
Test VOMS-listRoles     - OK
Test VOMS-listSubGroups - OK
Test VOMS-listUserAttributes    - OK
Test VOMS-listUserGroups        - OK
Test VOMS-listUserRoles - OK
Test VOMS-listUsers     - OK
Test VOMS-listUsrWithRol        - OK
Test VOMS-removeMember  - OK
Test VOMS-setGroupAttribute     - OK
Test VOMS-setRoleAttribute      - OK
Test VOMS-setUserAttribute      - OK

 

Regression tests

Line: 52 to 119
 

-- SergioTraldi - 2012-11-14

Added:
>
>
META FILEATTACHMENT attachment="updateSL5_EMI2_voms.txt" attr="h" comment="" date="1352909148" name="updateSL5_EMI2_voms.txt" path="updateSL5_EMI2_voms.txt" size="7089" user="SergioTraldi" version="1"
META FILEATTACHMENT attachment="updateSL6_EMI2_voms.txt" attr="h" comment="" date="1352909148" name="updateSL6_EMI2_voms.txt" path="updateSL6_EMI2_voms.txt" size="71421" user="SergioTraldi" version="1"
META FILEATTACHMENT attachment="configurationSL5_EM2_voms.txt" attr="h" comment="" date="1352909148" name="configurationSL5_EM2_voms.txt" path="configurationSL5_EM2_voms.txt" size="15943" user="SergioTraldi" version="1"
META FILEATTACHMENT attachment="configurationSL6_EM2_voms.txt" attr="h" comment="" date="1352909148" name="configurationSL6_EM2_voms.txt" path="configurationSL6_EM2_voms.txt" size="18832" user="SergioTraldi" version="1"
META FILEATTACHMENT attachment="full_result-cert-30" attr="h" comment="" date="1352909148" name="full_result-cert-30" path="full_result-cert-30" size="15388" user="SergioTraldi" version="1"

Revision 12012-11-14 - SergioTraldi

Line: 1 to 1
Added:
>
>

Testing report: IGIRTC-117

Summary

  • Product: VOMS api c++ & Java v. 2.0.9-1
  • Release Task: Task #34093
  • ETICS Subsystem Configuration Name:
  • VCS Tag:
  • EMI Major Release: EMI 2 (Matterhorn)
  • Platform: SL5 epel, SL6 epel, Debian
  • Author: Sergio Traldi
  • Testing report: Testing Report file
  • Certification report: Certification Report file
  • Outcome: "Certified*

Deployment tests

Clean Installation

VOMS mysql

Upgrade Installation

VOMS mysql

Unit Tests

System tests

Functionality tests

Regression tests

Standard Conformance Tests

Integration testing

-- SergioTraldi - 2012-11-14

 
This site is powered by the TWiki collaboration platformCopyright © 2008-2019 by the contributing authors. All material on this collaboration platform is the property of the contributing authors.
Ideas, requests, problems regarding TWiki? Send feedback