Difference: Task23312 (4 vs. 5)

Revision 52012-05-06 - CristinaAiftimiei

Line: 1 to 1
 
META TOPICPARENT name="TestingBlah"

Testing and Certification report savannah task #23312: BLAH v. 1.18.0 (EMI2)

Line: 460 to 460
 
bug #90101: Missing 'Iwd' Attribute when trasferring files with the 'TransferInput' attribute may cause thread to loop NA
Deleted:
<
<
bug #90927: Problem with init script for blparser NOT FIXED

  • CREAM SL5 new blparser:
# ps -ef |grep BU 
tomcat   17098     1  0 10:33 ?        00:00:00 /usr/libexec/BUpdaterLSF
root     23405 26254  0 11:22 pts/0    00:00:00 grep BU

# ps -ef |grep BN
tomcat   17130     1  0 10:33 ?        00:00:00 /usr/libexec/BNotifier
root     23408 26254  0 11:23 pts/0    00:00:00 grep BN

# /etc/init.d/glite-ce-blah-parser stop
Shutting down BNotifier:                                   [  OK  ]
Shutting down BUpdaterLSF:                                 [  OK  ]

# ps -ef |grep BU 
root     23474 26254  0 11:23 pts/0    00:00:00 grep BU
# ps -ef |grep BN
root     23476 26254  0 11:23 pts/0    00:00:00 grep BN

# /etc/init.d/glite-ce-blah-parser start
Starting BNotifier: /usr/libexec/BNotifier: Error creating and binding socket: Address already in use
                                                           [FAILED]
Starting BUpdaterLSF:                                      [  OK  ]

  • CREAM SL5 old parser
# ps -ef |grep bl
root        22     7  0 Apr30 ?        00:00:00 [kblockd/0]
root        23     7  0 Apr30 ?        00:00:00 [kblockd/1]
root      4294 26254  0 11:13 pts/0    00:00:00 grep bl

# /etc/init.d/glite-ce-blah-parser start
Starting blparser_master:                                  [  OK  ]

# ps -ef |grep bl
root        22     7  0 Apr30 ?        00:00:00 [kblockd/0]
root        23     7  0 Apr30 ?        00:00:00 [kblockd/1]
root      4350     1  0 11:13 ?        00:00:00 /usr/libexec/blparser_master
root      4363 26254  0 11:13 pts/0    00:00:00 grep bl

# /etc/init.d/glite-ce-blah-parser stop
Shutting down blparser_master:                             [  OK  ]

# ps -ef |grep bl
root        22     7  0 Apr30 ?        00:00:00 [kblockd/0]
root        23     7  0 Apr30 ?        00:00:00 [kblockd/1]
root      4475 26254  0 11:15 pts/0    00:00:00 grep bl

  • CREAM SL6 LSF New parser
# /etc/init.d/glite-ce-blah-parser stop
Shutting down BNotifier:                                   [  OK  ]
Shutting down BUpdaterLSF:                                 [  OK  ]
# /etc/init.d/glite-ce-blah-parser start
Starting BNotifier: /usr/libexec/BNotifier: Error creating and binding socket: Address already in use
                                                           [FAILED]
Starting BUpdaterLSF:                                      [  OK  ]

  • CREAM SL6 PBS new parser
#  /etc/init.d/glite-ce-blah-parser stop
Shutting down BNotifier:                                   [  OK  ]
Shutting down BUpdaterPBS:                                 [  OK  ]
You have new mail in /var/spool/mail/root
[root@emitestbed29 ~]#  /etc/init.d/glite-ce-blah-parser start
Starting BNotifier: /usr/libexec/BNotifier: Error creating and binding socket: Address already in use
                                                           [FAILED]
Starting BUpdaterPBS:                                      [  OK  ]
 
bug #91318: Request to change functions in blah_common_submit_functions.sh FIXED

Verifyed, in /usr/libexec/blah_common_submit_functions.sh the requested rows are present:

Line: 568 to 493
 
Deleted:
<
<
bug #90085 Suspend command doesn't work with old parser Implemented NOT FIXED

The files of this testsuite will be stored under: /tmp/tmpObO5Lk.cream_testing/
==============================================================================
Bug 90085 :: Regression test of bug #90985 Suspend command doesn't work wit...
==============================================================================
Set Log Level :: Set the log level used for the test suite. This c... | PASS |
------------------------------------------------------------------------------
bug_90085                                                             | FAIL |
_error: Expected status should be in ['HELD'] for job https://cream-48.pd.infn.it:8443/CREAM720879358 was actually IDLE
------------------------------------------------------------------------------
Teardown                                                              | PASS |
------------------------------------------------------------------------------
Bug 90085 :: Regression test of bug #90985 Suspend command doesn't... | FAIL |
3 critical tests, 2 passed, 1 failed
3 tests total, 2 passed, 1 failed
==============================================================================
 
Verification old bugs

bug #81824: yaim-cream-ce should manage the attribute bupdater_loop_interval FIXED
 
This site is powered by the TWiki collaboration platformCopyright © 2008-2019 by the contributing authors. All material on this collaboration platform is the property of the contributing authors.
Ideas, requests, problems regarding TWiki? Send feedback