Difference: Task23322-RC4 (9 vs. 10)

Revision 102012-04-17 - FabioCapannini

Line: 1 to 1
 
META TOPICPARENT name="TestingUI"

Testing report: IGIRTC #??

Line: 880 to 880
 

Added:
>
>

glite-wms-job-status

[capannini@emitestbed16 WMS-cli]$ python WMS-command_job-status.py -l
===> +++++++++++++++++++++++++++++++++++++++++++++++++++++
===> + TestSuite of the WMS CLI                       
===> + Description: test glite-wms-job-status commmad 
===> +++++++++++++++++++++++++++++++++++++++++++++++++++++

 Test 1 


 Test 2 


 Test 3 


 Test 4 


 Test 5 

CRITICAL:root:Command glite-wms-job-status --config /home/capannini/wms_tests/WMS-Test-Suite/WMS-cli/WMSCli-Test_20120417100818/wms.conf --output /home/capannini/wms_tests/WMS-Test-Suite/WMS-cli/WMSCli-Test_20120417100818/output.txt https://emitb1.ics.muni.cz:9000/U9CV0A6LKBB7nFIrJIjxQw failed !!!!
ERROR:root:Command glite-wms-job-status --config /home/capannini/wms_tests/WMS-Test-Suite/WMS-cli/WMSCli-Test_20120417100818/wms.conf --output /home/capannini/wms_tests/WMS-Test-Suite/WMS-cli/WMSCli-Test_20120417100818/output.txt https://emitb1.ics.muni.cz:9000/U9CV0A6LKBB7nFIrJIjxQw failed. Failure message: 
Traceback (most recent call last):
  File "/usr/bin/glite-wms-job-status", line 427, in ?
    wmsui_utils.print_message(wmsui_utils.info.logFile,message)
TypeError: print_message() takes at least 3 arguments (2 given)
===> ERROR: Command glite-wms-job-status --config /home/capannini/wms_tests/WMS-Test-Suite/WMS-cli/WMSCli-Test_20120417100818/wms.conf --output /home/capannini/wms_tests/WMS-Test-Suite/WMS-cli/WMSCli-Test_20120417100818/output.txt https://emitb1.ics.muni.cz:9000/U9CV0A6LKBB7nFIrJIjxQw failed. Failure message: 
Traceback (most recent call last):
  File "/usr/bin/glite-wms-job-status", line 427, in ?
    wmsui_utils.print_message(wmsui_utils.info.logFile,message)
TypeError: print_message() takes at least 3 arguments (2 given)

 Test 6 


 Test 7 

CRITICAL:root:Command glite-wms-job-status --config /home/capannini/wms_tests/WMS-Test-Suite/WMS-cli/WMSCli-Test_20120417100818/wms.conf --debug --logfile /home/capannini/wms_tests/WMS-Test-Suite/WMS-cli/WMSCli-Test_20120417100818/log.txt https://emitb1.ics.muni.cz:9000/U9CV0A6LKBB7nFIrJIjxQw failed !!!!
ERROR:root:Command glite-wms-job-status --config /home/capannini/wms_tests/WMS-Test-Suite/WMS-cli/WMSCli-Test_20120417100818/wms.conf --debug --logfile /home/capannini/wms_tests/WMS-Test-Suite/WMS-cli/WMSCli-Test_20120417100818/log.txt https://emitb1.ics.muni.cz:9000/U9CV0A6LKBB7nFIrJIjxQw failed. Failure message: 
Traceback (most recent call last):
  File "/usr/bin/glite-wms-job-status", line 180, in ?
    voName = wmsui_checks.checkConf (gname, virtualOrg, logpath)
  File "/usr/lib64/python2.4/site-packages/wmsui_checks.py", line 611, in checkConf
    wmsui_utils.print_message(wmsui_utils.info.logFile, msg)
TypeError: print_message() takes at least 3 arguments (2 given)
===> ERROR: Command glite-wms-job-status --config /home/capannini/wms_tests/WMS-Test-Suite/WMS-cli/WMSCli-Test_20120417100818/wms.conf --debug --logfile /home/capannini/wms_tests/WMS-Test-Suite/WMS-cli/WMSCli-Test_20120417100818/log.txt https://emitb1.ics.muni.cz:9000/U9CV0A6LKBB7nFIrJIjxQw failed. Failure message: 
Traceback (most recent call last):
  File "/usr/bin/glite-wms-job-status", line 180, in ?
    voName = wmsui_checks.checkConf (gname, virtualOrg, logpath)
  File "/usr/lib64/python2.4/site-packages/wmsui_checks.py", line 611, in checkConf
    wmsui_utils.print_message(wmsui_utils.info.logFile, msg)
TypeError: print_message() takes at least 3 arguments (2 given)

 Test 8 

===> 
===> Test: WMS-command_job-status.py
===> WMS: cert-08.cnaf.infn.it
===> Started: 10:08:18
===> Ended  : 10:10:51
===> 
===>   *** Warning: Interrupted by user *** 
===> 
===> 
===> Test log file is WMSCli-TS_20120417100818.log

Indeed, print_message() takes at least three arguments:

[capannini@emitestbed16 WMS-cli]$ grep print_message /usr/lib64/python2.4/site-packages/wmsui_utils.py|grep def
def print_message(json, log_file , message , stderror=0 ):

glite-wms-job-submit

[capannini@emitestbed16 WMS-cli]$ python WMS-command_job-submit.py -l
===> +++++++++++++++++++++++++++++++++++++++++++++++++++++
===> + TestSuite of the WMS CLI                       
===> + Description: test glite-wms-job-submit commmad 
===> +++++++++++++++++++++++++++++++++++++++++++++++++++++

 Test 1 


 Test 2 


 Test 3 


 Test 4 


 Test 5 


 Test 6 


 Test 7 


 Test 8 


 Test 9 


 Test 10 


 Test 11 


 Test 12 


 Test 13 


 Test 14 


 Test 15 


 Test 16 


 Test 17 


 Test 18 


 Test 19 


 Test 20 


 Test 21 


 Test 22 

===> 
===> Test: WMS-command_job-submit.py
===> WMS: cert-08.cnaf.infn.it
===> Started: 10:22:59
===> Ended  : 10:48:27
===> 
===>     >>> TEST FAILED <<<
===> 
===>  >>> failure reason: 1 test(s) fail(s) <<< 
===> 
===> Test log file is WMSCli-TS_20120417102259.log
===> Error messages have been written in /home/capannini/wms_tests/WMS-Test-Suite/WMS-cli/WMSCli-Test_20120417102259/errors.log
===> 
===>  Test directory /home/capannini/wms_tests/WMS-Test-Suite/WMS-cli/WMSCli-Test_20120417102259 has not been cleaned for debug purpose

 
META FILEATTACHMENT attachment="ui-sl5update.txt" attr="" comment="" date="1334323836" name="ui-sl5update.txt" path="ui-sl5update.txt" size="67807" user="AlessioGianelle" version="1"
META FILEATTACHMENT attachment="ui-sl5install.txt" attr="" comment="" date="1334327414" name="ui-sl5install.txt" path="ui-sl5install.txt" size="218411" user="AlessioGianelle" version="1"
Line: 894 to 1058
 
META FILEATTACHMENT attachment="WMSCli-TS_20120416164655.log" attr="" comment="" date="1334590487" name="WMSCli-TS_20120416164655.log" path="WMSCli-TS_20120416164655.log" size="24621" user="FabioCapannini" version="1"
META FILEATTACHMENT attachment="WMSCli-TS_20120416173621.log" attr="" comment="" date="1334591070" name="WMSCli-TS_20120416173621.log" path="WMSCli-TS_20120416173621.log" size="25159" user="FabioCapannini" version="1"
META FILEATTACHMENT attachment="WMSCli-TS_20120416181111.log" attr="" comment="" date="1334594031" name="WMSCli-TS_20120416181111.log" path="WMSCli-TS_20120416181111.log" size="18573" user="FabioCapannini" version="1"
Added:
>
>
META FILEATTACHMENT attachment="WMSCli-TS_20120417102259.log" attr="" comment="" date="1334653099" name="WMSCli-TS_20120417102259.log" path="WMSCli-TS_20120417102259.log" size="69110" user="FabioCapannini" version="1"
 
This site is powered by the TWiki collaboration platformCopyright © 2008-2020 by the contributing authors. All material on this collaboration platform is the property of the contributing authors.
Ideas, requests, problems regarding TWiki? Send feedback