Difference: Task23338 (1 vs. 8)

Revision 82012-05-04 - MicheleDibenedetto

Line: 1 to 1
 

Testing report: IGIRTC #69

Line: 802 to 802
 
META FILEATTACHMENT attachment="tstorm_1335787538.0.log" attr="h" comment="" date="1335790235" name="tstorm_1335787538.0.log" path="tstorm_1335787538.0.log" size="26111" user="SergioTraldi" version="1"
META FILEATTACHMENT attachment="tstorm_1335789619.0.log" attr="h" comment="" date="1335790235" name="tstorm_1335789619.0.log" path="tstorm_1335789619.0.log" size="25488" user="SergioTraldi" version="1"
META FILEATTACHMENT attachment="StoRM-EMI2-RC_Test_Report.txt" attr="h" comment="" date="1335947219" name="StoRM-EMI2-RC_Test_Report.txt" path="StoRM-EMI2-RC_Test_Report.txt" size="4945" user="SergioTraldi" version="1"
Changed:
<
<
META FILEATTACHMENT attachment="StoRM-EMI2-RC_Certification_Report_Task23338.txt" attr="" comment="" date="1336042341" name="StoRM-EMI2-RC_Certification_Report_Task23338.txt" path="StoRM-EMI2-RC_Certification_Report_Task23338.txt" size="3017" user="SergioTraldi" version="1"
META FILEATTACHMENT attachment="StoRM-EMI2-RC_Test_Report_Task23338.txt" attr="" comment="" date="1336042341" name="StoRM-EMI2-RC_Test_Report_Task23338.txt" path="StoRM-EMI2-RC_Test_Report_Task23338.txt" size="4945" user="SergioTraldi" version="1"
>
>
META FILEATTACHMENT attachment="StoRM-EMI2-RC_Certification_Report_Task23338.txt" attr="" comment="Updated to final version" date="1336155661" name="StoRM-EMI2-RC_Certification_Report_Task23338.txt" path="StoRM-EMI2-RC_Certification_Report_Task23338.txt" size="3054" user="MicheleDibenedetto" version="2"
META FILEATTACHMENT attachment="StoRM-EMI2-RC_Test_Report_Task23338.txt" attr="" comment="Updated to final version" date="1336155709" name="StoRM-EMI2-RC_Test_Report_Task23338.txt" path="StoRM-EMI2-RC_Test_Report_Task23338.txt" size="3657" user="MicheleDibenedetto" version="2"

Revision 72012-05-04 - MicheleDibenedetto

Line: 1 to 1
 

Testing report: IGIRTC #69

Line: 8 to 8
 
Changed:
<
<
  • ETICS Subsystem Configuration Name: emi-storm_R_EMI2RC
  • VCS Tag: emi-storm-backend-mp_R_1_1_0_1, emi-storm-frontend-mp_R_1_1_0_1, emi-storm-globus-gridftp-mp_R_1_1_0_1, BE_1.9.0-2, DIP-1.7.4-3, FE_1.8.0-5, GDSI_1.2.0-4, GHTTPS_1.1.0-1, yaim-storm_4.2.1-1
>
>
  • ETICS Subsystem Configuration Name: emi-storm_R_1_9_0_5
  • VCS Tag: emi-storm-backend-mp_R_1_1_0_1, emi-storm-frontend-mp_R_1_1_0_1, emi-storm-globus-gridftp-mp_R_1_1_0_1, emi-storm-gridhttps-mp_R_1_0_0_2. BE_1.9.0-2, DIP-1.7.4-3, FE_1.8.0-9, GDSI_1.2.0-4, GHTTPSP_1.0.3-4, GHTTPS_1.1.0-2, PAC_1.0.0-6, Client_1.6.0-6, XMLRPC_1.25.10-1206.2181.1, T-StoRM_1.2.1-2, yaim-storm_4.2.1-3
 
  • EMI Major Release: EMI 2 (Matterhorn)
Changed:
<
<
  • Platform: SL5 epel
>
>
  • Platform: sl5 epel, sl6 epel
 
Line: 286 to 287
 

Functionality tests

Changed:
<
<

After the installation

>
>

After the installation SL5

 
  • Run the testsuite
Line: 414 to 415
 Complete log file are here
Changed:
<
<

After the update

>
>

After the update SL5

 
  • Run the testsuite
Line: 538 to 539
 Complete log file are here
Added:
>
>

After the installation SL6

  • Run the testsuite

[traldi@cert-25 tstorm]$ vi usr/etc/tstorm/tstorm-PD.ini
map_tests_ids.json       tstorm-PD.ini            tstorm-tp.json.template  
tstorm.ini               tstorm-tp.json           
[traldi@cert-25 tstorm]$ vi usr/etc/tstorm/tstorm-PD.ini
[traldi@cert-25 tstorm]$ tstorm-tests -c tstorm-PD.ini
test_settings (tstorm.tests.utilities.UtilitiesTest) ... ok

----------------------------------------------------------------------
Ran 1 test in 0.001s

OK
test_storm_ping (tstorm.tests.atomic.atomics.AtomicsTest) ... ok

----------------------------------------------------------------------
Ran 1 test in 0.083s

OK
test_storm_ping_wo (tstorm.tests.atomic.atomics.AtomicsTest) ... ok

----------------------------------------------------------------------
Ran 1 test in 0.028s

OK
test_storm_gtp (tstorm.tests.atomic.atomics.AtomicsTest) ... ok

----------------------------------------------------------------------
Ran 1 test in 0.086s

OK
test_storm_gtp_wo (tstorm.tests.atomic.atomics.AtomicsTest) ... ok

----------------------------------------------------------------------
Ran 1 test in 0.027s

OK
test_dd (tstorm.tests.utilities.UtilitiesTest) ... ok
test_ls_unexist_file (tstorm.tests.atomic.atomics.AtomicsTest) ... ok
test_rm_lf (tstorm.tests.utilities.UtilitiesTest) ... ok

----------------------------------------------------------------------
Ran 3 tests in 0.362s

OK
test_dd (tstorm.tests.utilities.UtilitiesTest) ... ok
test_mkdir_dir (tstorm.tests.atomic.atomics.AtomicsTest) ... ok
test_rm_dir (tstorm.tests.atomic.atomics.AtomicsTest) ... ok
test_rm_lf (tstorm.tests.utilities.UtilitiesTest) ... ok

----------------------------------------------------------------------
Ran 4 tests in 20.766s

OK
test_dd (tstorm.tests.utilities.UtilitiesTest) ... ok
test_mkdir_dir (tstorm.tests.atomic.atomics.AtomicsTest) ... ok
test_mkdir_exist_dir (tstorm.tests.atomic.atomics.AtomicsTest) ... ok
test_rm_dir (tstorm.tests.atomic.atomics.AtomicsTest) ... ok
test_rm_lf (tstorm.tests.utilities.UtilitiesTest) ... ok

----------------------------------------------------------------------
Ran 5 tests in 30.592s

OK
test_dd (tstorm.tests.utilities.UtilitiesTest) ... ok
test_mkdir_dir (tstorm.tests.atomic.atomics.AtomicsTest) ... ok
test_mkdir_exist_dir (tstorm.tests.atomic.atomics.AtomicsTest) ... ok
test_ls_dir (tstorm.tests.atomic.atomics.AtomicsTest) ... ok
test_rm_dir (tstorm.tests.atomic.atomics.AtomicsTest) ... ok
test_rm_lf (tstorm.tests.utilities.UtilitiesTest) ... ok

----------------------------------------------------------------------
Ran 6 tests in 30.979s

OK
test_dd (tstorm.tests.utilities.UtilitiesTest) ... ok
test_cp_bt (tstorm.tests.atomic.atomics.AtomicsTest) ... ok
test_rm_file (tstorm.tests.atomic.atomics.AtomicsTest) ... ok
test_rm_dir (tstorm.tests.atomic.atomics.AtomicsTest) ... ok
test_rm_lf (tstorm.tests.utilities.UtilitiesTest) ... ok

----------------------------------------------------------------------
Ran 5 tests in 19.273s

OK
test_dd (tstorm.tests.utilities.UtilitiesTest) ... ok
test_cp_bt (tstorm.tests.atomic.atomics.AtomicsTest) ... ok
test_ls_file (tstorm.tests.atomic.atomics.AtomicsTest) ... ok
test_rm_file (tstorm.tests.atomic.atomics.AtomicsTest) ... ok
test_rm_dir (tstorm.tests.atomic.atomics.AtomicsTest) ... ok
test_rm_lf (tstorm.tests.utilities.UtilitiesTest) ... ok

----------------------------------------------------------------------
Ran 6 tests in 17.979s

OK
test_dd (tstorm.tests.utilities.UtilitiesTest) ... ok
test_cp_bt (tstorm.tests.atomic.atomics.AtomicsTest) ... ok
test_ls_file (tstorm.tests.atomic.atomics.AtomicsTest) ... ok
test_rm_file (tstorm.tests.atomic.atomics.AtomicsTest) ... ok
test_rm_dir (tstorm.tests.atomic.atomics.AtomicsTest) ... ok
test_rm_lf (tstorm.tests.utilities.UtilitiesTest) ... ok

----------------------------------------------------------------------
Ran 6 tests in 18.079s

OK
test_dd (tstorm.tests.utilities.UtilitiesTest) ... ok
test_rm_unexist_dir (tstorm.tests.atomic.atomics.AtomicsTest) ... ok
test_rm_lf (tstorm.tests.utilities.UtilitiesTest) ... ok

----------------------------------------------------------------------
Ran 3 tests in 10.395s

OK
test_dd (tstorm.tests.utilities.UtilitiesTest) ... ok
test_cp_bt (tstorm.tests.atomic.atomics.AtomicsTest) ... ok
test_cp_at (tstorm.tests.atomic.atomics.AtomicsTest) ... ok
test_rm_file (tstorm.tests.atomic.atomics.AtomicsTest) ... ok
test_rm_dir (tstorm.tests.atomic.atomics.AtomicsTest) ... ok
test_rm_lf (tstorm.tests.utilities.UtilitiesTest) ... ok

----------------------------------------------------------------------
Ran 6 tests in 22.306s

OK
test_dd (tstorm.tests.utilities.UtilitiesTest) ... ok
test_ls_unexist_file (tstorm.tests.atomic.atomics.AtomicsTest) ... ok
test_mkdir_dir (tstorm.tests.atomic.atomics.AtomicsTest) ... ok
test_mkdir_exist_dir (tstorm.tests.atomic.atomics.AtomicsTest) ... ok
test_ls_dir (tstorm.tests.atomic.atomics.AtomicsTest) ... ok
test_cp_bt (tstorm.tests.atomic.atomics.AtomicsTest) ... ok
test_ls_file (tstorm.tests.atomic.atomics.AtomicsTest) ... ok
test_cp_at (tstorm.tests.atomic.atomics.AtomicsTest) ... ok
test_rm_file (tstorm.tests.atomic.atomics.AtomicsTest) ... ok
test_rm_unexist_file (tstorm.tests.atomic.atomics.AtomicsTest) ... ok
test_rm_dir (tstorm.tests.atomic.atomics.AtomicsTest) ... ok
test_rm_unexist_dir (tstorm.tests.atomic.atomics.AtomicsTest) ... ok
test_rm_lf (tstorm.tests.utilities.UtilitiesTest) ... ok

----------------------------------------------------------------------
Ran 13 tests in 59.761s

OK
test_dd (tstorm.tests.utilities.UtilitiesTest) ... ok
test_cksm (tstorm.tests.functional.functionalities.FunctionalitiesTest) ... ok
test_rm_lf (tstorm.tests.utilities.UtilitiesTest) ... ok

----------------------------------------------------------------------
Ran 3 tests in 18.825s

OK
test_dd (tstorm.tests.utilities.UtilitiesTest) ... ok
test_data_transfer_out_file (tstorm.tests.functional.functionalities.FunctionalitiesTest) ... ok
test_data_transfer_out_exist_file (tstorm.tests.functional.functionalities.FunctionalitiesTest) ... ok
test_data_transfer_in_file (tstorm.tests.functional.functionalities.FunctionalitiesTest) ... ok
test_data_transfer_in_unexist_file (tstorm.tests.functional.functionalities.FunctionalitiesTest) ... ok
test_rm_file (tstorm.tests.atomic.atomics.AtomicsTest) ... ok
test_rm_dir (tstorm.tests.atomic.atomics.AtomicsTest) ... ok
test_rm_lf (tstorm.tests.utilities.UtilitiesTest) ... ok

----------------------------------------------------------------------
Ran 8 tests in 23.838s

OK
test_cr_lf (tstorm.tests.utilities.UtilitiesTest) ... ok
test_srm_transfer_outbound_https_voms (tstorm.tests.functional.https.HttpsTest) ... ok
test_direct_transfer_outbound_https_voms (tstorm.tests.functional.https.HttpsTest) ... ok
test_direct_transfer_outbound_https_voms_exist_file (tstorm.tests.functional.https.HttpsTest) ... ok
test_direct_transfer_inbound_https_voms (tstorm.tests.functional.https.HttpsTest) ... ok
test_direct_transfer_inbound_https_voms_no_auth (tstorm.tests.functional.https.HttpsTest) ... ok
test_direct_transfer_inbound_https_voms_unexist_file (tstorm.tests.functional.https.HttpsTest) ... ok
test_srm_transfer_inbound_https_voms (tstorm.tests.functional.https.HttpsTest) ... ok
test_rm_lf (tstorm.tests.utilities.UtilitiesTest) ... ok

----------------------------------------------------------------------
Ran 9 tests in 6.090s

OK
test_update_free_space_upon_rm (tstorm.tests.functional.regression.regression.RegressionTest) ... ok

----------------------------------------------------------------------
Ran 1 test in 3.183s

OK
test_eight_digit_string_checksum (tstorm.tests.functional.regression.regression.RegressionTest) ... ok

----------------------------------------------------------------------
Ran 1 test in 35.091s

OK
test_update_used_space_upon_pd (tstorm.tests.functional.regression.regression.RegressionTest) ... ok

----------------------------------------------------------------------
Ran 1 test in 2.968s

OK
test_unsupported_protocols (tstorm.tests.functional.regression.regression.RegressionTest) ... ok

----------------------------------------------------------------------
Ran 1 test in 0.077s

OK
test_non_ascii_chars (tstorm.tests.functional.regression.regression.RegressionTest) ... ok

----------------------------------------------------------------------
Ran 1 test in 0.153s

OK
test_storm_backend_age (tstorm.tests.functional.regression.regression.RegressionTest) ... ok

----------------------------------------------------------------------
Ran 1 test in 0.078s

OK
test_storm_database_password (tstorm.tests.functional.regression.regression.RegressionTest) ... ok

----------------------------------------------------------------------
Ran 1 test in 3.722s

OK
test_storm_gridhttps_authorization_denied (tstorm.tests.functional.regression.regression.RegressionTest) ... ok

----------------------------------------------------------------------
Ran 1 test in 2.640s

OK

Complete log file are here

 

Regression tests

Changed:
<
<
Not Possible (Task is incompleted)
>
>

After the installation SL5

 
Changed:
<
<
-- SergioTraldi - 2012-04-26
>
>

After the upgrade SL5

 
Added:
>
>

After the installation SL6

-- SergioTraldi - 2012-04-26

 
META FILEATTACHMENT attachment="conf_Storm.cert-29.0426-1433.log" attr="h" comment="" date="1335516767" name="conf_Storm.cert-29.0426-1433.log" path="conf_Storm.cert-29.0426-1433.log" size="66016" user="SergioTraldi" version="1"
META FILEATTACHMENT attachment="conf_Storm.emitestbed04.0426-1658.log" attr="h" comment="" date="1335516767" name="conf_Storm.emitestbed04.0426-1658.log" path="conf_Storm.emitestbed04.0426-1658.log" size="62302" user="SergioTraldi" version="1"

Revision 62012-05-03 - SergioTraldi

Line: 1 to 1
 

Testing report: IGIRTC #69

Line: 13 to 13
 
  • EMI Major Release: EMI 2 (Matterhorn)
  • Platform: SL5 epel
  • Author: Sergio Traldi
Changed:
<
<
>
>
 
  • Date: 26th April 2012
  • Outcome: DONE
Line: 544 to 544
  -- SergioTraldi - 2012-04-26
Deleted:
<
<

 
META FILEATTACHMENT attachment="conf_Storm.cert-29.0426-1433.log" attr="h" comment="" date="1335516767" name="conf_Storm.cert-29.0426-1433.log" path="conf_Storm.cert-29.0426-1433.log" size="66016" user="SergioTraldi" version="1"
META FILEATTACHMENT attachment="conf_Storm.emitestbed04.0426-1658.log" attr="h" comment="" date="1335516767" name="conf_Storm.emitestbed04.0426-1658.log" path="conf_Storm.emitestbed04.0426-1658.log" size="62302" user="SergioTraldi" version="1"
Line: 584 to 557
 
META FILEATTACHMENT attachment="storm-SL6-install.txt" attr="h" comment="" date="1335517048" name="storm-SL6-install.txt" path="storm-SL6-install.txt" size="199159" user="SergioTraldi" version="1"
META FILEATTACHMENT attachment="tstorm_1335787538.0.log" attr="h" comment="" date="1335790235" name="tstorm_1335787538.0.log" path="tstorm_1335787538.0.log" size="26111" user="SergioTraldi" version="1"
META FILEATTACHMENT attachment="tstorm_1335789619.0.log" attr="h" comment="" date="1335790235" name="tstorm_1335789619.0.log" path="tstorm_1335789619.0.log" size="25488" user="SergioTraldi" version="1"
Deleted:
<
<
META FILEATTACHMENT attachment="StoRM-EMI2-RC_Certification_Report.txt" attr="h" comment="" date="1335947219" name="StoRM-EMI2-RC_Certification_Report.txt" path="StoRM-EMI2-RC_Certification_Report.txt" size="3010" user="SergioTraldi" version="1"
 
META FILEATTACHMENT attachment="StoRM-EMI2-RC_Test_Report.txt" attr="h" comment="" date="1335947219" name="StoRM-EMI2-RC_Test_Report.txt" path="StoRM-EMI2-RC_Test_Report.txt" size="4945" user="SergioTraldi" version="1"
Added:
>
>
META FILEATTACHMENT attachment="StoRM-EMI2-RC_Certification_Report_Task23338.txt" attr="" comment="" date="1336042341" name="StoRM-EMI2-RC_Certification_Report_Task23338.txt" path="StoRM-EMI2-RC_Certification_Report_Task23338.txt" size="3017" user="SergioTraldi" version="1"
META FILEATTACHMENT attachment="StoRM-EMI2-RC_Test_Report_Task23338.txt" attr="" comment="" date="1336042341" name="StoRM-EMI2-RC_Test_Report_Task23338.txt" path="StoRM-EMI2-RC_Test_Report_Task23338.txt" size="4945" user="SergioTraldi" version="1"

Revision 42012-05-02 - SergioTraldi

Line: 1 to 1
Changed:
<
<

Testing report: IGIRTC #69

>
>

Testing report: IGIRTC #68

 
Line: 13 to 13
 
  • EMI Major Release: EMI 2 (Matterhorn)
  • Platform: SL5 epel
  • Author: Sergio Traldi
Changed:
<
<
>
>
 
  • Date: 26th April 2012
  • Outcome: DONE
Line: 568 to 568
 
Added:
>
>

 
META FILEATTACHMENT attachment="conf_Storm.cert-29.0426-1433.log" attr="h" comment="" date="1335516767" name="conf_Storm.cert-29.0426-1433.log" path="conf_Storm.cert-29.0426-1433.log" size="66016" user="SergioTraldi" version="1"
META FILEATTACHMENT attachment="conf_Storm.emitestbed04.0426-1658.log" attr="h" comment="" date="1335516767" name="conf_Storm.emitestbed04.0426-1658.log" path="conf_Storm.emitestbed04.0426-1658.log" size="62302" user="SergioTraldi" version="1"
META FILEATTACHMENT attachment="conf_Storm.emitestbed25.20120427.log" attr="h" comment="" date="1335516767" name="conf_Storm.emitestbed25.20120427.log" path="conf_Storm.emitestbed25.20120427.log" size="62395" user="SergioTraldi" version="1"
Line: 580 to 584
 
META FILEATTACHMENT attachment="storm-SL6-install.txt" attr="h" comment="" date="1335517048" name="storm-SL6-install.txt" path="storm-SL6-install.txt" size="199159" user="SergioTraldi" version="1"
META FILEATTACHMENT attachment="tstorm_1335787538.0.log" attr="h" comment="" date="1335790235" name="tstorm_1335787538.0.log" path="tstorm_1335787538.0.log" size="26111" user="SergioTraldi" version="1"
META FILEATTACHMENT attachment="tstorm_1335789619.0.log" attr="h" comment="" date="1335790235" name="tstorm_1335789619.0.log" path="tstorm_1335789619.0.log" size="25488" user="SergioTraldi" version="1"
Added:
>
>
META FILEATTACHMENT attachment="StoRM-EMI2-RC_Certification_Report.txt" attr="h" comment="" date="1335947219" name="StoRM-EMI2-RC_Certification_Report.txt" path="StoRM-EMI2-RC_Certification_Report.txt" size="3010" user="SergioTraldi" version="1"
META FILEATTACHMENT attachment="StoRM-EMI2-RC_Test_Report.txt" attr="h" comment="" date="1335947219" name="StoRM-EMI2-RC_Test_Report.txt" path="StoRM-EMI2-RC_Test_Report.txt" size="4945" user="SergioTraldi" version="1"

Revision 32012-04-30 - SergioTraldi

Line: 1 to 1
 

Testing report: IGIRTC #69

Line: 280 to 280
 

Unit Tests

Changed:
<
<
Not Available
>
>
* Unit Test provided by developers
 

System tests

Line: 291 to 291
 
  • Run the testsuite
Added:
>
>
[traldi@cert-25 tstorm]$ vi usr/etc/tstorm/tstorm-PD.ini map_tests_ids.json tstorm-PD.ini tstorm-tp.json.template tstorm.ini tstorm-tp.json [traldi@cert-25 tstorm]$ vi usr/etc/tstorm/tstorm-PD.ini
 [traldi@cert-25 tstorm]$ tstorm-tests -c tstorm-PD.ini test_settings (tstorm.tests.utilities.UtilitiesTest) ... ok


Changed:
<
<
Ran 1 test in 0.001s
>
>
Ran 1 test in 0.000s
  OK test_storm_ping (tstorm.tests.atomics.AtomicsTest) ... ok


Changed:
<
<
Ran 1 test in 0.125s
>
>
Ran 1 test in 0.071s
  OK test_dd (tstorm.tests.utilities.UtilitiesTest) ... ok
Line: 319 to 323
 test_rm_lf (tstorm.tests.utilities.UtilitiesTest) ... ok


Changed:
<
<
Ran 13 tests in 51.866s
>
>
Ran 13 tests in 54.373s
  OK test_dd (tstorm.tests.utilities.UtilitiesTest) ... ok
Line: 327 to 331
 test_rm_lf (tstorm.tests.utilities.UtilitiesTest) ... ok


Changed:
<
<
Ran 3 tests in 16.747s
>
>
Ran 3 tests in 18.228s
  OK test_dd (tstorm.tests.utilities.UtilitiesTest) ... ok
Line: 340 to 344
 test_rm_lf (tstorm.tests.utilities.UtilitiesTest) ... ok


Changed:
<
<
Ran 8 tests in 27.257s
>
>
Ran 8 tests in 23.158s
  OK test_cr_lf (tstorm.tests.utilities.UtilitiesTest) ... ok
Line: 348 to 352
 test_direct_transfer_outbound_https_voms (tstorm.tests.https.HttpsTest) ... ok test_direct_transfer_outbound_https_voms_exist_file (tstorm.tests.https.HttpsTest) ... ok test_direct_transfer_inbound_https_voms (tstorm.tests.https.HttpsTest) ... ok
Changed:
<
<
test_direct_transfer_inbound_https_voms_no_auth (tstorm.tests.https.HttpsTest) ... FAIL
>
>
test_direct_transfer_inbound_https_voms_no_auth (tstorm.tests.https.HttpsTest) ... ok
 test_direct_transfer_inbound_https_voms_unexist_file (tstorm.tests.https.HttpsTest) ... ok test_srm_transfer_inbound_https_voms (tstorm.tests.https.HttpsTest) ... ok test_rm_lf (tstorm.tests.utilities.UtilitiesTest) ... ok
Deleted:
<
<
================================================================== FAIL: test_direct_transfer_inbound_https_voms_no_auth (tstorm.tests.https.HttpsTest)
 
Changed:
<
<
Traceback (most recent call last): File "/usr/lib/python2.4/site-packages/tstorm/tests/https.py", line 524, in test_direct_transfer_inbound_https_voms_no_auth AssertionError
>
>
Ran 9 tests in 5.085s
 
Changed:
<
<

Ran 9 tests in 6.886s

FAILED (failures=1)

>
>
OK
 test_update_free_space_upon_rm (tstorm.tests.regression.RegressionTest) ... ok


Changed:
<
<
Ran 1 test in 4.352s
>
>
Ran 1 test in 3.143s
  OK test_eight_digit_string_checksum (tstorm.tests.regression.RegressionTest) ... ok


Changed:
<
<
Ran 1 test in 10.096s
>
>
Ran 1 test in 4.095s
  OK test_update_used_space_upon_pd (tstorm.tests.regression.RegressionTest) ... ok


Changed:
<
<
Ran 1 test in 7.159s
>
>
Ran 1 test in 3.040s
  OK test_unsupported_protocols (tstorm.tests.regression.RegressionTest) ... ok


Changed:
<
<
Ran 1 test in 0.065s
>
>
Ran 1 test in 0.064s
  OK test_non_ascii_chars (tstorm.tests.regression.RegressionTest) ... ok


Changed:
<
<
Ran 1 test in 0.133s
>
>
Ran 1 test in 0.118s
  OK test_storm_backend_age (tstorm.tests.regression.RegressionTest) ... ok


Changed:
<
<
Ran 1 test in 0.073s
>
>
Ran 1 test in 0.064s
  OK test_storm_database_password (tstorm.tests.regression.RegressionTest) ... ok


Changed:
<
<
Ran 1 test in 2.733s
>
>
Ran 1 test in 3.892s
  OK test_storm_gridhttps_authorization_denied (tstorm.tests.regression.RegressionTest) ... ok


Changed:
<
<
Ran 1 test in 2.752s
>
>
Ran 1 test in 1.766s
  OK
Changed:
<
<
Complete log file are here
>
>
Complete log file are here
 
Deleted:
<
<
  • Tests without voms extension


Complete log file are here

 

After the update

  • Run the testsuite
Changed:
<
<
[traldi@cert-25 tstorm]$ tstorm-teststest_settings (tstorm.tests.utilities.UtilitiesTest) ... ok
>
>
[traldi@cert-25 tstorm]$ tstorm-tests test_settings (tstorm.tests.utilities.UtilitiesTest) ... ok
 
Changed:
<
<
Ran 1 test in 0.000s
>
>
Ran 1 test in 0.001s
  OK test_storm_ping (tstorm.tests.atomics.AtomicsTest) ... ok


Changed:
<
<
Ran 1 test in 0.082s
>
>
Ran 1 test in 0.079s
  OK test_dd (tstorm.tests.utilities.UtilitiesTest) ... ok
Line: 455 to 447
 test_rm_lf (tstorm.tests.utilities.UtilitiesTest) ... ok


Changed:
<
<
Ran 13 tests in 54.045s
>
>
Ran 13 tests in 69.323s
  OK test_dd (tstorm.tests.utilities.UtilitiesTest) ... ok
Line: 463 to 455
 test_rm_lf (tstorm.tests.utilities.UtilitiesTest) ... ok


Changed:
<
<
Ran 3 tests in 24.555s
>
>
Ran 3 tests in 17.398s
  OK test_dd (tstorm.tests.utilities.UtilitiesTest) ... ok
Line: 476 to 468
 test_rm_lf (tstorm.tests.utilities.UtilitiesTest) ... ok


Changed:
<
<
Ran 8 tests in 27.576s
>
>
Ran 8 tests in 29.350s
  OK test_cr_lf (tstorm.tests.utilities.UtilitiesTest) ... ok
Line: 484 to 476
 test_direct_transfer_outbound_https_voms (tstorm.tests.https.HttpsTest) ... ok test_direct_transfer_outbound_https_voms_exist_file (tstorm.tests.https.HttpsTest) ... ok test_direct_transfer_inbound_https_voms (tstorm.tests.https.HttpsTest) ... ok
Changed:
<
<
test_direct_transfer_inbound_https_voms_no_auth (tstorm.tests.https.HttpsTest) ... FAIL
>
>
test_direct_transfer_inbound_https_voms_no_auth (tstorm.tests.https.HttpsTest) ... ok
 test_direct_transfer_inbound_https_voms_unexist_file (tstorm.tests.https.HttpsTest) ... ok test_srm_transfer_inbound_https_voms (tstorm.tests.https.HttpsTest) ... ok test_rm_lf (tstorm.tests.utilities.UtilitiesTest) ... ok
Deleted:
<
<
================================================================== FAIL: test_direct_transfer_inbound_https_voms_no_auth (tstorm.tests.https.HttpsTest)
Traceback (most recent call last): File "/usr/lib/python2.4/site-packages/tstorm/tests/https.py", line 524, in test_direct_transfer_inbound_https_voms_no_auth AssertionError
 
Changed:
<
<
Ran 9 tests in 4.002s
>
>
Ran 9 tests in 7.747s
 
Changed:
<
<
FAILED (failures=1)
>
>
OK
 test_update_free_space_upon_rm (tstorm.tests.regression.RegressionTest) ... ok


Changed:
<
<
Ran 1 test in 6.537s
>
>
Ran 1 test in 9.643s
  OK test_eight_digit_string_checksum (tstorm.tests.regression.RegressionTest) ... ok


Changed:
<
<
Ran 1 test in 4.067s
>
>
Ran 1 test in 4.080s
  OK test_update_used_space_upon_pd (tstorm.tests.regression.RegressionTest) ... ok


Changed:
<
<
Ran 1 test in 5.237s
>
>
Ran 1 test in 6.292s
  OK test_unsupported_protocols (tstorm.tests.regression.RegressionTest) ... ok
Line: 527 to 512
 test_non_ascii_chars (tstorm.tests.regression.RegressionTest) ... ok


Changed:
<
<
Ran 1 test in 0.155s
>
>
Ran 1 test in 0.156s
  OK test_storm_backend_age (tstorm.tests.regression.RegressionTest) ... ok


Changed:
<
<
Ran 1 test in 0.081s
>
>
Ran 1 test in 0.080s
  OK test_storm_database_password (tstorm.tests.regression.RegressionTest) ... ok


Changed:
<
<
Ran 1 test in 3.917s
>
>
Ran 1 test in 3.885s
  OK test_storm_gridhttps_authorization_denied (tstorm.tests.regression.RegressionTest) ... ok


Changed:
<
<
Ran 1 test in 1.630s
>
>
Ran 1 test in 1.595s
  OK
Changed:
<
<
Complete log file are here

  • Tests without voms extension


Complete log file are here

>
>
Complete log file are here
 

Regression tests

Line: 586 to 564
 
Added:
>
>

 
META FILEATTACHMENT attachment="conf_Storm.cert-29.0426-1433.log" attr="h" comment="" date="1335516767" name="conf_Storm.cert-29.0426-1433.log" path="conf_Storm.cert-29.0426-1433.log" size="66016" user="SergioTraldi" version="1"
META FILEATTACHMENT attachment="conf_Storm.emitestbed04.0426-1658.log" attr="h" comment="" date="1335516767" name="conf_Storm.emitestbed04.0426-1658.log" path="conf_Storm.emitestbed04.0426-1658.log" size="62302" user="SergioTraldi" version="1"
META FILEATTACHMENT attachment="conf_Storm.emitestbed25.20120427.log" attr="h" comment="" date="1335516767" name="conf_Storm.emitestbed25.20120427.log" path="conf_Storm.emitestbed25.20120427.log" size="62395" user="SergioTraldi" version="1"
Line: 596 to 578
 
META FILEATTACHMENT attachment="tstorm_1335514105.0.log" attr="h" comment="" date="1335516767" name="tstorm_1335514105.0.log" path="tstorm_1335514105.0.log" size="25415" user="SergioTraldi" version="1"
META FILEATTACHMENT attachment="storm-SL5-install.txt" attr="h" comment="" date="1335517048" name="storm-SL5-install.txt" path="storm-SL5-install.txt" size="134660" user="SergioTraldi" version="1"
META FILEATTACHMENT attachment="storm-SL6-install.txt" attr="h" comment="" date="1335517048" name="storm-SL6-install.txt" path="storm-SL6-install.txt" size="199159" user="SergioTraldi" version="1"
Added:
>
>
META FILEATTACHMENT attachment="tstorm_1335787538.0.log" attr="h" comment="" date="1335790235" name="tstorm_1335787538.0.log" path="tstorm_1335787538.0.log" size="26111" user="SergioTraldi" version="1"
META FILEATTACHMENT attachment="tstorm_1335789619.0.log" attr="h" comment="" date="1335790235" name="tstorm_1335789619.0.log" path="tstorm_1335789619.0.log" size="25488" user="SergioTraldi" version="1"

Revision 22012-04-27 - SergioTraldi

Line: 1 to 1
 

Testing report: IGIRTC #69

Line: 20 to 20
 

Deployment tests

Changed:
<
<

Clean Installation

>
>

Clean Installation SL5

 
Line: 144 to 144
 OK
Changed:
<
<

Upgrade Installation

>
>

Upgrade Installation SL5

 
Changed:
<
<
>
>
  * Configuration log file
Changed:
<
<
  • Run sanity check test locally (complete log file are here):
>
>
  • Run sanity check test locally (complete log file are here):
 
test_glue_service (tstorm.tests.deployment.regression.ldapquery.LdapTest) ... ok
Line: 268 to 268
 
Added:
>
>

Clean Installation SL6


 

Unit Tests

Not Available

Line: 281 to 291
 
  • Run the testsuite
Changed:
<
<
[ale@cream-12 tstorm-1.2.0-5]$ tstorm-tests -c tstorm.ini
>
>
[traldi@cert-25 tstorm]$ tstorm-tests -c tstorm-PD.ini
 test_settings (tstorm.tests.utilities.UtilitiesTest) ... ok


Line: 291 to 301
 test_storm_ping (tstorm.tests.atomics.AtomicsTest) ... ok


Changed:
<
<
Ran 1 test in 0.058s
>
>
Ran 1 test in 0.125s
  OK test_dd (tstorm.tests.utilities.UtilitiesTest) ... ok
Line: 309 to 319
 test_rm_lf (tstorm.tests.utilities.UtilitiesTest) ... ok


Changed:
<
<
Ran 13 tests in 37.451s
>
>
Ran 13 tests in 51.866s
  OK test_dd (tstorm.tests.utilities.UtilitiesTest) ... ok
Line: 317 to 327
 test_rm_lf (tstorm.tests.utilities.UtilitiesTest) ... ok


Changed:
<
<
Ran 3 tests in 11.955s
>
>
Ran 3 tests in 16.747s
  OK test_dd (tstorm.tests.utilities.UtilitiesTest) ... ok
Line: 330 to 340
 test_rm_lf (tstorm.tests.utilities.UtilitiesTest) ... ok


Changed:
<
<
Ran 8 tests in 27.656s
>
>
Ran 8 tests in 27.257s
  OK test_cr_lf (tstorm.tests.utilities.UtilitiesTest) ... ok
Line: 338 to 348
 test_direct_transfer_outbound_https_voms (tstorm.tests.https.HttpsTest) ... ok test_direct_transfer_outbound_https_voms_exist_file (tstorm.tests.https.HttpsTest) ... ok test_direct_transfer_inbound_https_voms (tstorm.tests.https.HttpsTest) ... ok
Changed:
<
<
test_direct_transfer_inbound_https_voms_no_auth (tstorm.tests.https.HttpsTest) ... ok
>
>
test_direct_transfer_inbound_https_voms_no_auth (tstorm.tests.https.HttpsTest) ... FAIL
 test_direct_transfer_inbound_https_voms_unexist_file (tstorm.tests.https.HttpsTest) ... ok test_srm_transfer_inbound_https_voms (tstorm.tests.https.HttpsTest) ... ok test_rm_lf (tstorm.tests.utilities.UtilitiesTest) ... ok
Added:
>
>
================================================================== FAIL: test_direct_transfer_inbound_https_voms_no_auth (tstorm.tests.https.HttpsTest)
 
Changed:
<
<
Ran 9 tests in 7.123s
>
>
Traceback (most recent call last): File "/usr/lib/python2.4/site-packages/tstorm/tests/https.py", line 524, in test_direct_transfer_inbound_https_voms_no_auth AssertionError
 
Changed:
<
<
OK
>
>

Ran 9 tests in 6.886s

FAILED (failures=1)

 test_update_free_space_upon_rm (tstorm.tests.regression.RegressionTest) ... ok


Changed:
<
<
Ran 1 test in 10.034s
>
>
Ran 1 test in 4.352s
  OK test_eight_digit_string_checksum (tstorm.tests.regression.RegressionTest) ... ok


Changed:
<
<
Ran 1 test in 2.664s
>
>
Ran 1 test in 10.096s
  OK test_update_used_space_upon_pd (tstorm.tests.regression.RegressionTest) ... ok


Changed:
<
<
Ran 1 test in 9.885s
>
>
Ran 1 test in 7.159s
  OK test_unsupported_protocols (tstorm.tests.regression.RegressionTest) ... ok


Changed:
<
<
Ran 1 test in 0.054s
>
>
Ran 1 test in 0.065s
  OK test_non_ascii_chars (tstorm.tests.regression.RegressionTest) ... ok


Changed:
<
<
Ran 1 test in 0.109s
>
>
Ran 1 test in 0.133s
  OK test_storm_backend_age (tstorm.tests.regression.RegressionTest) ... ok


Changed:
<
<
Ran 1 test in 0.066s
>
>
Ran 1 test in 0.073s
  OK test_storm_database_password (tstorm.tests.regression.RegressionTest) ... ok


Changed:
<
<
Ran 1 test in 17.830s
>
>
Ran 1 test in 2.733s
  OK test_storm_gridhttps_authorization_denied (tstorm.tests.regression.RegressionTest) ... ok


Changed:
<
<
Ran 1 test in 1.467s
>
>
Ran 1 test in 2.752s
  OK
Changed:
<
<
Complete log file are here
>
>
Complete log file are here
 
  • Tests without voms extension
Deleted:
<
<
[ale@cream-12 tstorm-1.2.0-5]$ voms-proxy-init Your identity: /C=IT/O=INFN/OU=Personal Certificate/L=Padova/CN=Alessio Gianelle Creating proxy ............................................................. Done

Your proxy is valid until Fri Apr 13 04:05:07 2012 [ale@cream-12 tstorm-1.2.0-5]$ voms-proxy-info -all subject : /C=IT/O=INFN/OU=Personal Certificate/L=Padova/CN=Alessio Gianelle/CN=proxy issuer : /C=IT/O=INFN/OU=Personal Certificate/L=Padova/CN=Alessio Gianelle identity : /C=IT/O=INFN/OU=Personal Certificate/L=Padova/CN=Alessio Gianelle type : proxy strength : 1024 bits path : /tmp/x509up_u500 timeleft : 11:59:54 key usage : Digital Signature, Key Encipherment, Data Encipherment

[ale@cream-12 tstorm-1.2.0-5]$ tstorm-tests -c tstorm.ini --novoms test_settings (tstorm.tests.utilities.UtilitiesTest) ... ok


Ran 1 test in 0.000s

OK test_cr_lf (tstorm.tests.utilities.UtilitiesTest) ... ok test_srm_transfer_outbound_http (tstorm.tests.https.HttpsTest) ... ok test_direct_transfer_outbound_http (tstorm.tests.https.HttpsTest) ... ok test_direct_transfer_outbound_http_exist_file (tstorm.tests.https.HttpsTest) ... ok test_direct_transfer_inbound_http (tstorm.tests.https.HttpsTest) ... ok test_direct_transfer_inbound_http_unexist_file (tstorm.tests.https.HttpsTest) ... ok test_srm_transfer_inbound_http (tstorm.tests.https.HttpsTest) ... ok test_rm_lf (tstorm.tests.utilities.UtilitiesTest) ... ok


Ran 8 tests in 2.632s

OK test_cr_lf (tstorm.tests.utilities.UtilitiesTest) ... ok test_srm_transfer_outbound_https (tstorm.tests.https.HttpsTest) ... ok test_direct_transfer_outbound_https (tstorm.tests.https.HttpsTest) ... ok test_direct_transfer_outbound_https_exist_file (tstorm.tests.https.HttpsTest) ... ok test_direct_transfer_inbound_https (tstorm.tests.https.HttpsTest) ... ADD UID for test_direct_transfer_inbound_https ok test_direct_transfer_inbound_https_no_auth (tstorm.tests.https.HttpsTest) ... ok test_direct_transfer_inbound_https_unexist_file (tstorm.tests.https.HttpsTest) ... ok test_srm_transfer_inbound_https (tstorm.tests.https.HttpsTest) ... ok test_rm_lf (tstorm.tests.utilities.UtilitiesTest) ... ok


Ran 9 tests in 4.071s

OK test_get_space_metadata_failure (tstorm.tests.regression.RegressionTest) ... ok


Ran 1 test in 0.074s

OK

 
Changed:
<
<
Complete log file are here

>
>
Complete log file are here
 

After the update

  • Run the testsuite
Changed:
<
<
test_settings (tstorm.tests.utilities.UtilitiesTest) ... ok
>
>
[traldi@cert-25 tstorm]$ tstorm-teststest_settings (tstorm.tests.utilities.UtilitiesTest) ... ok
 
Ran 1 test in 0.000s
Line: 479 to 437
 test_storm_ping (tstorm.tests.atomics.AtomicsTest) ... ok


Changed:
<
<
Ran 1 test in 0.155s
>
>
Ran 1 test in 0.082s
  OK test_dd (tstorm.tests.utilities.UtilitiesTest) ... ok
Line: 497 to 455
 test_rm_lf (tstorm.tests.utilities.UtilitiesTest) ... ok


Changed:
<
<
Ran 13 tests in 40.250s
>
>
Ran 13 tests in 54.045s
  OK test_dd (tstorm.tests.utilities.UtilitiesTest) ... ok
Line: 505 to 463
 test_rm_lf (tstorm.tests.utilities.UtilitiesTest) ... ok


Changed:
<
<
Ran 3 tests in 11.324s
>
>
Ran 3 tests in 24.555s
  OK test_dd (tstorm.tests.utilities.UtilitiesTest) ... ok
Line: 518 to 476
 test_rm_lf (tstorm.tests.utilities.UtilitiesTest) ... ok


Changed:
<
<
Ran 8 tests in 20.754s
>
>
Ran 8 tests in 27.576s
  OK test_cr_lf (tstorm.tests.utilities.UtilitiesTest) ... ok
Line: 526 to 484
 test_direct_transfer_outbound_https_voms (tstorm.tests.https.HttpsTest) ... ok test_direct_transfer_outbound_https_voms_exist_file (tstorm.tests.https.HttpsTest) ... ok test_direct_transfer_inbound_https_voms (tstorm.tests.https.HttpsTest) ... ok
Changed:
<
<
test_direct_transfer_inbound_https_voms_no_auth (tstorm.tests.https.HttpsTest) ... ok
>
>
test_direct_transfer_inbound_https_voms_no_auth (tstorm.tests.https.HttpsTest) ... FAIL
 test_direct_transfer_inbound_https_voms_unexist_file (tstorm.tests.https.HttpsTest) ... ok test_srm_transfer_inbound_https_voms (tstorm.tests.https.HttpsTest) ... ok test_rm_lf (tstorm.tests.utilities.UtilitiesTest) ... ok
Added:
>
>
================================================================== FAIL: test_direct_transfer_inbound_https_voms_no_auth (tstorm.tests.https.HttpsTest)
 
Changed:
<
<
Ran 9 tests in 6.682s
>
>
Traceback (most recent call last): File "/usr/lib/python2.4/site-packages/tstorm/tests/https.py", line 524, in test_direct_transfer_inbound_https_voms_no_auth AssertionError
 
Changed:
<
<
OK
>
>

Ran 9 tests in 4.002s

FAILED (failures=1)

 test_update_free_space_upon_rm (tstorm.tests.regression.RegressionTest) ... ok


Changed:
<
<
Ran 1 test in 3.294s
>
>
Ran 1 test in 6.537s
  OK test_eight_digit_string_checksum (tstorm.tests.regression.RegressionTest) ... ok


Changed:
<
<
Ran 1 test in 2.862s
>
>
Ran 1 test in 4.067s
  OK test_update_used_space_upon_pd (tstorm.tests.regression.RegressionTest) ... ok


Changed:
<
<
Ran 1 test in 4.185s
>
>
Ran 1 test in 5.237s
  OK test_unsupported_protocols (tstorm.tests.regression.RegressionTest) ... ok


Changed:
<
<
Ran 1 test in 0.071s
>
>
Ran 1 test in 0.077s
  OK test_non_ascii_chars (tstorm.tests.regression.RegressionTest) ... ok


Changed:
<
<
Ran 1 test in 0.145s
>
>
Ran 1 test in 0.155s
  OK test_storm_backend_age (tstorm.tests.regression.RegressionTest) ... ok


Changed:
<
<
Ran 1 test in 0.074s
>
>
Ran 1 test in 0.081s
  OK test_storm_database_password (tstorm.tests.regression.RegressionTest) ... ok


Changed:
<
<
Ran 1 test in 4.106s
>
>
Ran 1 test in 3.917s
  OK test_storm_gridhttps_authorization_denied (tstorm.tests.regression.RegressionTest) ... ok


Changed:
<
<
Ran 1 test in 2.653s
>
>
Ran 1 test in 1.630s
  OK
Changed:
<
<
Complete log file are here
>
>
Complete log file are here
 
  • Tests without voms extension
Changed:
<
<
[ale@cream-12 tstorm-1.2.0-5]$ voms-proxy-init Your identity: /C=IT/O=INFN/OU=Personal Certificate/L=Padova/CN=Alessio Gianelle Creating proxy .................................................... Done

Your proxy is valid until Thu Apr 12 02:21:52 2012 [ale@cream-12 tstorm-1.2.0-5]$ voms-proxy-info -all subject : /C=IT/O=INFN/OU=Personal Certificate/L=Padova/CN=Alessio Gianelle/CN=proxy issuer : /C=IT/O=INFN/OU=Personal Certificate/L=Padova/CN=Alessio Gianelle identity : /C=IT/O=INFN/OU=Personal Certificate/L=Padova/CN=Alessio Gianelle type : proxy strength : 1024 bits path : /tmp/x509up_u500 timeleft : 11:59:54 key usage : Digital Signature, Key Encipherment, Data Encipherment

>
>
 
Added:
>
>
Complete log file are here
 
Deleted:
<
<
[ale@cream-12 tstorm-1.2.0-5]$ tstorm-tests --novoms test_settings (tstorm.tests.utilities.UtilitiesTest) ... ok
 
Changed:
<
<

Ran 1 test in 0.000s
>
>

Regression tests

 
Changed:
<
<
OK test_cr_lf (tstorm.tests.utilities.UtilitiesTest) ... ok test_srm_transfer_outbound_http (tstorm.tests.https.HttpsTest) ... ok test_direct_transfer_outbound_http (tstorm.tests.https.HttpsTest) ... ok test_direct_transfer_outbound_http_exist_file (tstorm.tests.https.HttpsTest) ... ok test_direct_transfer_inbound_http (tstorm.tests.https.HttpsTest) ... ok test_direct_transfer_inbound_http_unexist_file (tstorm.tests.https.HttpsTest) ... ok test_srm_transfer_inbound_http (tstorm.tests.https.HttpsTest) ... ok test_rm_lf (tstorm.tests.utilities.UtilitiesTest) ... ok
>
>
Not Possible (Task is incompleted)
 
Changed:
<
<

Ran 8 tests in 3.879s
>
>
-- SergioTraldi - 2012-04-26
 
Changed:
<
<
OK test_cr_lf (tstorm.tests.utilities.UtilitiesTest) ... ok test_srm_transfer_outbound_https (tstorm.tests.https.HttpsTest) ... ok test_direct_transfer_outbound_https (tstorm.tests.https.HttpsTest) ... ok test_direct_transfer_outbound_https_exist_file (tstorm.tests.https.HttpsTest) ... ok test_direct_transfer_inbound_https (tstorm.tests.https.HttpsTest) ... ADD UID for test_direct_transfer_inbound_https ok test_direct_transfer_inbound_https_no_auth (tstorm.tests.https.HttpsTest) ... ok test_direct_transfer_inbound_https_unexist_file (tstorm.tests.https.HttpsTest) ... ok test_srm_transfer_inbound_https (tstorm.tests.https.HttpsTest) ... ok test_rm_lf (tstorm.tests.utilities.UtilitiesTest) ... ok
>
>
 
Changed:
<
<

Ran 9 tests in 3.379s
>
>
 
Changed:
<
<
OK test_get_space_metadata_failure (tstorm.tests.regression.RegressionTest) ... ok
>
>
 
Changed:
<
<

Ran 1 test in 0.100s
>
>
 
Changed:
<
<
OK
>
>
 
Changed:
<
<
>
>
 
Changed:
<
<
Complete log file are here
>
>
 
Added:
>
>
 
Changed:
<
<

Regression tests

>
>
 
Changed:
<
<
Not Possible (Task is incompleted)
>
>
 
Changed:
<
<
-- SergioTraldi - 2012-04-26
>
>
META FILEATTACHMENT attachment="conf_Storm.cert-29.0426-1433.log" attr="h" comment="" date="1335516767" name="conf_Storm.cert-29.0426-1433.log" path="conf_Storm.cert-29.0426-1433.log" size="66016" user="SergioTraldi" version="1"
META FILEATTACHMENT attachment="conf_Storm.emitestbed04.0426-1658.log" attr="h" comment="" date="1335516767" name="conf_Storm.emitestbed04.0426-1658.log" path="conf_Storm.emitestbed04.0426-1658.log" size="62302" user="SergioTraldi" version="1"
META FILEATTACHMENT attachment="conf_Storm.emitestbed25.20120427.log" attr="h" comment="" date="1335516767" name="conf_Storm.emitestbed25.20120427.log" path="conf_Storm.emitestbed25.20120427.log" size="62395" user="SergioTraldi" version="1"
META FILEATTACHMENT attachment="storm-SL5-update.txt" attr="h" comment="" date="1335516767" name="storm-SL5-update.txt" path="storm-SL5-update.txt" size="29576" user="SergioTraldi" version="1"
META FILEATTACHMENT attachment="tstorm_1335449094.0.log" attr="h" comment="" date="1335516767" name="tstorm_1335449094.0.log" path="tstorm_1335449094.0.log" size="11115" user="SergioTraldi" version="1"
META FILEATTACHMENT attachment="tstorm_1335455094.0.log" attr="h" comment="" date="1335516767" name="tstorm_1335455094.0.log" path="tstorm_1335455094.0.log" size="10716" user="SergioTraldi" version="1"
META FILEATTACHMENT attachment="tstorm_1335513330.0.log" attr="h" comment="" date="1335516767" name="tstorm_1335513330.0.log" path="tstorm_1335513330.0.log" size="26038" user="SergioTraldi" version="1"
META FILEATTACHMENT attachment="tstorm_1335514105.0.log" attr="h" comment="" date="1335516767" name="tstorm_1335514105.0.log" path="tstorm_1335514105.0.log" size="25415" user="SergioTraldi" version="1"
META FILEATTACHMENT attachment="storm-SL5-install.txt" attr="h" comment="" date="1335517048" name="storm-SL5-install.txt" path="storm-SL5-install.txt" size="134660" user="SergioTraldi" version="1"
META FILEATTACHMENT attachment="storm-SL6-install.txt" attr="h" comment="" date="1335517048" name="storm-SL6-install.txt" path="storm-SL6-install.txt" size="199159" user="SergioTraldi" version="1"

Revision 12012-04-26 - SergioTraldi

Line: 1 to 1
Added:
>
>

Testing report: IGIRTC #69

Summary

  • Product: Storm 1.9.0
  • Release Task: Task #23338
  • ETICS Subsystem Configuration Name: emi-storm_R_EMI2RC
  • VCS Tag: emi-storm-backend-mp_R_1_1_0_1, emi-storm-frontend-mp_R_1_1_0_1, emi-storm-globus-gridftp-mp_R_1_1_0_1, BE_1.9.0-2, DIP-1.7.4-3, FE_1.8.0-5, GDSI_1.2.0-4, GHTTPS_1.1.0-1, yaim-storm_4.2.1-1
  • EMI Major Release: EMI 2 (Matterhorn)
  • Platform: SL5 epel
  • Author: Sergio Traldi
  • Testing report: see here
  • Certification report: see here
  • Date: 26th April 2012
  • Outcome: DONE

Deployment tests

Clean Installation

  • Run sanity check test locally (complete log file are here):
[root@cert-29 tstorm]# tstorm-sanity-tests
test_glue_service (tstorm.tests.deployment.regression.ldapquery.LdapTest) ... ok

----------------------------------------------------------------------
Ran 1 test in 0.002s

OK
test_gluetwo_storage_share_capacity (tstorm.tests.deployment.regression.gluetwo_ldapquery.GluetwoLdapTest) ... ok

----------------------------------------------------------------------
Ran 1 test in 0.002s

OK
test_glue_available_space_info_service (tstorm.tests.deployment.regression.ldapquery.LdapTest) ... ok

----------------------------------------------------------------------
Ran 1 test in 0.068s

OK
test_glue_available_space (tstorm.tests.deployment.regression.ldapquery.LdapTest) ... ok

----------------------------------------------------------------------
Ran 1 test in 0.071s

OK
test_glue_used_space (tstorm.tests.deployment.regression.ldapquery.LdapTest) ... ok

----------------------------------------------------------------------
Ran 1 test in 0.078s

OK
test_size (tstorm.tests.deployment.regression.ldapquery.LdapTest) ... ok

----------------------------------------------------------------------
Ran 1 test in 0.083s

OK
test_info_service_failure (tstorm.tests.deployment.regression.ldapquery.LdapTest) ... ok

----------------------------------------------------------------------
Ran 1 test in 0.056s

OK
test_gluetwo_endpoint_undefined (tstorm.tests.deployment.regression.gluetwo_ldapquery.GluetwoLdapTest) ... ok

----------------------------------------------------------------------
Ran 1 test in 0.003s

OK
test_gluetwo_storage_undefined (tstorm.tests.deployment.regression.gluetwo_ldapquery.GluetwoLdapTest) ... ok

----------------------------------------------------------------------
Ran 1 test in 0.002s

OK
test_gluetwo_endpoint (tstorm.tests.deployment.regression.gluetwo_ldapquery.GluetwoLdapTest) ... ok

----------------------------------------------------------------------
Ran 1 test in 0.001s

OK
test_backend_server_status (tstorm.tests.deployment.regression.service_configuration.RegressionConfigurationTest) ... ok

----------------------------------------------------------------------
Ran 1 test in 0.238s

OK
test_backend_logrotate_file (tstorm.tests.deployment.regression.service_configuration.RegressionConfigurationTest) ... ok

----------------------------------------------------------------------
Ran 1 test in 0.007s

OK
test_backend_gridhttps (tstorm.tests.deployment.regression.service_configuration.RegressionConfigurationTest) ... ok

----------------------------------------------------------------------
Ran 1 test in 0.266s

OK
test_yaim_version_file (tstorm.tests.deployment.regression.service_configuration.RegressionConfigurationTest) ... ok

----------------------------------------------------------------------
Ran 1 test in 0.511s

OK
test_size_in_namespace_file (tstorm.tests.deployment.regression.service_configuration.RegressionConfigurationTest) ... ok

----------------------------------------------------------------------
Ran 1 test in 0.011s

OK
test_gridhttps_plugin_links (tstorm.tests.deployment.regression.service_configuration.RegressionConfigurationTest) ... ok

----------------------------------------------------------------------
Ran 1 test in 0.023s

OK
test_backend_server_name_status (tstorm.tests.deployment.regression.service_configuration.RegressionConfigurationTest) ... ok

----------------------------------------------------------------------
Ran 1 test in 0.233s

OK
test_mysql_storage_space_update (tstorm.tests.deployment.regression.service_configuration.RegressionConfigurationTest) ... ok

----------------------------------------------------------------------
Ran 1 test in 113.980s

OK
test_mysql_connector_java_links (tstorm.tests.deployment.regression.service_configuration.RegressionConfigurationTest) ... ok

----------------------------------------------------------------------
Ran 1 test in 0.014s

OK

Upgrade Installation

  • Run sanity check test locally (complete log file are here):
test_glue_service (tstorm.tests.deployment.regression.ldapquery.LdapTest) ... ok

----------------------------------------------------------------------
Ran 1 test in 0.019s

OK
test_gluetwo_storage_share_capacity (tstorm.tests.deployment.regression.gluetwo_ldapquery.GluetwoLdapTest) ... ok

----------------------------------------------------------------------
Ran 1 test in 0.002s

OK
test_glue_available_space_info_service (tstorm.tests.deployment.regression.ldapquery.LdapTest) ... ok

----------------------------------------------------------------------
Ran 1 test in 0.025s

OK
test_glue_available_space (tstorm.tests.deployment.regression.ldapquery.LdapTest) ... ok

----------------------------------------------------------------------
Ran 1 test in 0.031s

OK
test_glue_used_space (tstorm.tests.deployment.regression.ldapquery.LdapTest) ... ok

----------------------------------------------------------------------
Ran 1 test in 0.028s

OK
test_size (tstorm.tests.deployment.regression.ldapquery.LdapTest) ... ok

----------------------------------------------------------------------
Ran 1 test in 0.028s

OK
test_info_service_failure (tstorm.tests.deployment.regression.ldapquery.LdapTest) ... ok

----------------------------------------------------------------------
Ran 1 test in 0.038s

OK
test_gluetwo_endpoint_undefined (tstorm.tests.deployment.regression.gluetwo_ldapquery.GluetwoLdapTest) ... ok

----------------------------------------------------------------------
Ran 1 test in 0.001s

OK
test_gluetwo_storage_undefined (tstorm.tests.deployment.regression.gluetwo_ldapquery.GluetwoLdapTest) ... ok

----------------------------------------------------------------------
Ran 1 test in 0.001s

OK
test_gluetwo_endpoint (tstorm.tests.deployment.regression.gluetwo_ldapquery.GluetwoLdapTest) ... ok

----------------------------------------------------------------------
Ran 1 test in 0.001s

OK
test_backend_server_status (tstorm.tests.deployment.regression.service_configuration.RegressionConfigurationTest) ... ok

----------------------------------------------------------------------
Ran 1 test in 0.209s

OK
test_backend_logrotate_file (tstorm.tests.deployment.regression.service_configuration.RegressionConfigurationTest) ... ok

----------------------------------------------------------------------
Ran 1 test in 0.009s

OK
test_backend_gridhttps (tstorm.tests.deployment.regression.service_configuration.RegressionConfigurationTest) ... ok

----------------------------------------------------------------------
Ran 1 test in 0.236s

OK
test_yaim_version_file (tstorm.tests.deployment.regression.service_configuration.RegressionConfigurationTest) ... ok

----------------------------------------------------------------------
Ran 1 test in 0.511s

OK
test_size_in_namespace_file (tstorm.tests.deployment.regression.service_configuration.RegressionConfigurationTest) ... ok

----------------------------------------------------------------------
Ran 1 test in 0.009s

OK
test_gridhttps_plugin_links (tstorm.tests.deployment.regression.service_configuration.RegressionConfigurationTest) ... ok

----------------------------------------------------------------------
Ran 1 test in 0.016s

OK
test_backend_server_name_status (tstorm.tests.deployment.regression.service_configuration.RegressionConfigurationTest) ... ok

----------------------------------------------------------------------
Ran 1 test in 0.220s

OK
test_mysql_storage_space_update (tstorm.tests.deployment.regression.service_configuration.RegressionConfigurationTest) ... ok

----------------------------------------------------------------------
Ran 1 test in 102.593s

OK
test_mysql_connector_java_links (tstorm.tests.deployment.regression.service_configuration.RegressionConfigurationTest) ... ok

----------------------------------------------------------------------
Ran 1 test in 0.010s

OK

Unit Tests

Not Available

System tests

Functionality tests

After the installation

  • Run the testsuite

[ale@cream-12 tstorm-1.2.0-5]$ tstorm-tests -c tstorm.ini
test_settings (tstorm.tests.utilities.UtilitiesTest) ... ok

----------------------------------------------------------------------
Ran 1 test in 0.001s

OK
test_storm_ping (tstorm.tests.atomics.AtomicsTest) ... ok

----------------------------------------------------------------------
Ran 1 test in 0.058s

OK
test_dd (tstorm.tests.utilities.UtilitiesTest) ... ok
test_ls_unexist_file (tstorm.tests.atomics.AtomicsTest) ... ok
test_mkdir_dir (tstorm.tests.atomics.AtomicsTest) ... ok
test_mkdir_exist_dir (tstorm.tests.atomics.AtomicsTest) ... ok
test_ls_dir (tstorm.tests.atomics.AtomicsTest) ... ok
test_cp_bt (tstorm.tests.atomics.AtomicsTest) ... ok
test_ls_file (tstorm.tests.atomics.AtomicsTest) ... ok
test_cp_at (tstorm.tests.atomics.AtomicsTest) ... ok
test_rm_file (tstorm.tests.atomics.AtomicsTest) ... ok
test_rm_unexist_file (tstorm.tests.atomics.AtomicsTest) ... ok
test_rm_dir (tstorm.tests.atomics.AtomicsTest) ... ok
test_rm_unexist_dir (tstorm.tests.atomics.AtomicsTest) ... ok
test_rm_lf (tstorm.tests.utilities.UtilitiesTest) ... ok

----------------------------------------------------------------------
Ran 13 tests in 37.451s

OK
test_dd (tstorm.tests.utilities.UtilitiesTest) ... ok
test_cksm (tstorm.tests.functionalities.FunctionalitiesTest) ... ok
test_rm_lf (tstorm.tests.utilities.UtilitiesTest) ... ok

----------------------------------------------------------------------
Ran 3 tests in 11.955s

OK
test_dd (tstorm.tests.utilities.UtilitiesTest) ... ok
test_data_transfer_out_file (tstorm.tests.functionalities.FunctionalitiesTest) ... ok
test_data_transfer_out_exist_file (tstorm.tests.functionalities.FunctionalitiesTest) ... ok
test_data_transfer_in_file (tstorm.tests.functionalities.FunctionalitiesTest) ... ok
test_data_transfer_in_unexist_file (tstorm.tests.functionalities.FunctionalitiesTest) ... ok
test_rm_file (tstorm.tests.atomics.AtomicsTest) ... ok
test_rm_dir (tstorm.tests.atomics.AtomicsTest) ... ok
test_rm_lf (tstorm.tests.utilities.UtilitiesTest) ... ok

----------------------------------------------------------------------
Ran 8 tests in 27.656s

OK
test_cr_lf (tstorm.tests.utilities.UtilitiesTest) ... ok
test_srm_transfer_outbound_https_voms (tstorm.tests.https.HttpsTest) ... ok
test_direct_transfer_outbound_https_voms (tstorm.tests.https.HttpsTest) ... ok
test_direct_transfer_outbound_https_voms_exist_file (tstorm.tests.https.HttpsTest) ... ok
test_direct_transfer_inbound_https_voms (tstorm.tests.https.HttpsTest) ... ok
test_direct_transfer_inbound_https_voms_no_auth (tstorm.tests.https.HttpsTest) ... ok
test_direct_transfer_inbound_https_voms_unexist_file (tstorm.tests.https.HttpsTest) ... ok
test_srm_transfer_inbound_https_voms (tstorm.tests.https.HttpsTest) ... ok
test_rm_lf (tstorm.tests.utilities.UtilitiesTest) ... ok

----------------------------------------------------------------------
Ran 9 tests in 7.123s

OK
test_update_free_space_upon_rm (tstorm.tests.regression.RegressionTest) ... ok

----------------------------------------------------------------------
Ran 1 test in 10.034s

OK
test_eight_digit_string_checksum (tstorm.tests.regression.RegressionTest) ... ok

----------------------------------------------------------------------
Ran 1 test in 2.664s

OK
test_update_used_space_upon_pd (tstorm.tests.regression.RegressionTest) ... ok

----------------------------------------------------------------------
Ran 1 test in 9.885s

OK
test_unsupported_protocols (tstorm.tests.regression.RegressionTest) ... ok

----------------------------------------------------------------------
Ran 1 test in 0.054s

OK
test_non_ascii_chars (tstorm.tests.regression.RegressionTest) ... ok

----------------------------------------------------------------------
Ran 1 test in 0.109s

OK
test_storm_backend_age (tstorm.tests.regression.RegressionTest) ... ok

----------------------------------------------------------------------
Ran 1 test in 0.066s

OK
test_storm_database_password (tstorm.tests.regression.RegressionTest) ... ok

----------------------------------------------------------------------
Ran 1 test in 17.830s

OK
test_storm_gridhttps_authorization_denied (tstorm.tests.regression.RegressionTest) ... ok

----------------------------------------------------------------------
Ran 1 test in 1.467s

OK

Complete log file are here

  • Tests without voms extension

[ale@cream-12 tstorm-1.2.0-5]$ voms-proxy-init 
Your identity: /C=IT/O=INFN/OU=Personal Certificate/L=Padova/CN=Alessio Gianelle
Creating proxy ............................................................. Done

Your proxy is valid until Fri Apr 13 04:05:07 2012
[ale@cream-12 tstorm-1.2.0-5]$ voms-proxy-info -all
subject   : /C=IT/O=INFN/OU=Personal Certificate/L=Padova/CN=Alessio Gianelle/CN=proxy
issuer    : /C=IT/O=INFN/OU=Personal Certificate/L=Padova/CN=Alessio Gianelle
identity  : /C=IT/O=INFN/OU=Personal Certificate/L=Padova/CN=Alessio Gianelle
type      : proxy
strength  : 1024 bits
path      : /tmp/x509up_u500
timeleft  : 11:59:54
key usage : Digital Signature, Key Encipherment, Data Encipherment

[ale@cream-12 tstorm-1.2.0-5]$ tstorm-tests -c tstorm.ini --novoms
test_settings (tstorm.tests.utilities.UtilitiesTest) ... ok

----------------------------------------------------------------------
Ran 1 test in 0.000s

OK
test_cr_lf (tstorm.tests.utilities.UtilitiesTest) ... ok
test_srm_transfer_outbound_http (tstorm.tests.https.HttpsTest) ... ok
test_direct_transfer_outbound_http (tstorm.tests.https.HttpsTest) ... ok
test_direct_transfer_outbound_http_exist_file (tstorm.tests.https.HttpsTest) ... ok
test_direct_transfer_inbound_http (tstorm.tests.https.HttpsTest) ... ok
test_direct_transfer_inbound_http_unexist_file (tstorm.tests.https.HttpsTest) ... ok
test_srm_transfer_inbound_http (tstorm.tests.https.HttpsTest) ... ok
test_rm_lf (tstorm.tests.utilities.UtilitiesTest) ... ok

----------------------------------------------------------------------
Ran 8 tests in 2.632s

OK
test_cr_lf (tstorm.tests.utilities.UtilitiesTest) ... ok
test_srm_transfer_outbound_https (tstorm.tests.https.HttpsTest) ... ok
test_direct_transfer_outbound_https (tstorm.tests.https.HttpsTest) ... ok
test_direct_transfer_outbound_https_exist_file (tstorm.tests.https.HttpsTest) ... ok
test_direct_transfer_inbound_https (tstorm.tests.https.HttpsTest) ... ADD UID for test_direct_transfer_inbound_https
ok
test_direct_transfer_inbound_https_no_auth (tstorm.tests.https.HttpsTest) ... ok
test_direct_transfer_inbound_https_unexist_file (tstorm.tests.https.HttpsTest) ... ok
test_srm_transfer_inbound_https (tstorm.tests.https.HttpsTest) ... ok
test_rm_lf (tstorm.tests.utilities.UtilitiesTest) ... ok

----------------------------------------------------------------------
Ran 9 tests in 4.071s

OK
test_get_space_metadata_failure (tstorm.tests.regression.RegressionTest) ... ok

----------------------------------------------------------------------
Ran 1 test in 0.074s

OK

Complete log file are here

After the update

  • Run the testsuite

test_settings (tstorm.tests.utilities.UtilitiesTest) ... ok

----------------------------------------------------------------------
Ran 1 test in 0.000s

OK
test_storm_ping (tstorm.tests.atomics.AtomicsTest) ... ok

----------------------------------------------------------------------
Ran 1 test in 0.155s

OK
test_dd (tstorm.tests.utilities.UtilitiesTest) ... ok
test_ls_unexist_file (tstorm.tests.atomics.AtomicsTest) ... ok
test_mkdir_dir (tstorm.tests.atomics.AtomicsTest) ... ok
test_mkdir_exist_dir (tstorm.tests.atomics.AtomicsTest) ... ok
test_ls_dir (tstorm.tests.atomics.AtomicsTest) ... ok
test_cp_bt (tstorm.tests.atomics.AtomicsTest) ... ok
test_ls_file (tstorm.tests.atomics.AtomicsTest) ... ok
test_cp_at (tstorm.tests.atomics.AtomicsTest) ... ok
test_rm_file (tstorm.tests.atomics.AtomicsTest) ... ok
test_rm_unexist_file (tstorm.tests.atomics.AtomicsTest) ... ok
test_rm_dir (tstorm.tests.atomics.AtomicsTest) ... ok
test_rm_unexist_dir (tstorm.tests.atomics.AtomicsTest) ... ok
test_rm_lf (tstorm.tests.utilities.UtilitiesTest) ... ok

----------------------------------------------------------------------
Ran 13 tests in 40.250s

OK
test_dd (tstorm.tests.utilities.UtilitiesTest) ... ok
test_cksm (tstorm.tests.functionalities.FunctionalitiesTest) ... ok
test_rm_lf (tstorm.tests.utilities.UtilitiesTest) ... ok

----------------------------------------------------------------------
Ran 3 tests in 11.324s

OK
test_dd (tstorm.tests.utilities.UtilitiesTest) ... ok
test_data_transfer_out_file (tstorm.tests.functionalities.FunctionalitiesTest) ... ok
test_data_transfer_out_exist_file (tstorm.tests.functionalities.FunctionalitiesTest) ... ok
test_data_transfer_in_file (tstorm.tests.functionalities.FunctionalitiesTest) ... ok
test_data_transfer_in_unexist_file (tstorm.tests.functionalities.FunctionalitiesTest) ... ok
test_rm_file (tstorm.tests.atomics.AtomicsTest) ... ok
test_rm_dir (tstorm.tests.atomics.AtomicsTest) ... ok
test_rm_lf (tstorm.tests.utilities.UtilitiesTest) ... ok

----------------------------------------------------------------------
Ran 8 tests in 20.754s

OK
test_cr_lf (tstorm.tests.utilities.UtilitiesTest) ... ok
test_srm_transfer_outbound_https_voms (tstorm.tests.https.HttpsTest) ... ok
test_direct_transfer_outbound_https_voms (tstorm.tests.https.HttpsTest) ... ok
test_direct_transfer_outbound_https_voms_exist_file (tstorm.tests.https.HttpsTest) ... ok
test_direct_transfer_inbound_https_voms (tstorm.tests.https.HttpsTest) ... ok
test_direct_transfer_inbound_https_voms_no_auth (tstorm.tests.https.HttpsTest) ... ok
test_direct_transfer_inbound_https_voms_unexist_file (tstorm.tests.https.HttpsTest) ... ok
test_srm_transfer_inbound_https_voms (tstorm.tests.https.HttpsTest) ... ok
test_rm_lf (tstorm.tests.utilities.UtilitiesTest) ... ok

----------------------------------------------------------------------
Ran 9 tests in 6.682s

OK
test_update_free_space_upon_rm (tstorm.tests.regression.RegressionTest) ... ok

----------------------------------------------------------------------
Ran 1 test in 3.294s

OK
test_eight_digit_string_checksum (tstorm.tests.regression.RegressionTest) ... ok

----------------------------------------------------------------------
Ran 1 test in 2.862s

OK
test_update_used_space_upon_pd (tstorm.tests.regression.RegressionTest) ... ok

----------------------------------------------------------------------
Ran 1 test in 4.185s

OK
test_unsupported_protocols (tstorm.tests.regression.RegressionTest) ... ok

----------------------------------------------------------------------
Ran 1 test in 0.071s

OK
test_non_ascii_chars (tstorm.tests.regression.RegressionTest) ... ok

----------------------------------------------------------------------
Ran 1 test in 0.145s

OK
test_storm_backend_age (tstorm.tests.regression.RegressionTest) ... ok

----------------------------------------------------------------------
Ran 1 test in 0.074s

OK
test_storm_database_password (tstorm.tests.regression.RegressionTest) ... ok

----------------------------------------------------------------------
Ran 1 test in 4.106s

OK
test_storm_gridhttps_authorization_denied (tstorm.tests.regression.RegressionTest) ... ok

----------------------------------------------------------------------
Ran 1 test in 2.653s

OK

Complete log file are here

  • Tests without voms extension

[ale@cream-12 tstorm-1.2.0-5]$ voms-proxy-init 
Your identity: /C=IT/O=INFN/OU=Personal Certificate/L=Padova/CN=Alessio Gianelle
Creating proxy .................................................... Done

Your proxy is valid until Thu Apr 12 02:21:52 2012
[ale@cream-12 tstorm-1.2.0-5]$ voms-proxy-info -all
subject   : /C=IT/O=INFN/OU=Personal Certificate/L=Padova/CN=Alessio Gianelle/CN=proxy
issuer    : /C=IT/O=INFN/OU=Personal Certificate/L=Padova/CN=Alessio Gianelle
identity  : /C=IT/O=INFN/OU=Personal Certificate/L=Padova/CN=Alessio Gianelle
type      : proxy
strength  : 1024 bits
path      : /tmp/x509up_u500
timeleft  : 11:59:54
key usage : Digital Signature, Key Encipherment, Data Encipherment


[ale@cream-12 tstorm-1.2.0-5]$ tstorm-tests --novoms
test_settings (tstorm.tests.utilities.UtilitiesTest) ... ok

----------------------------------------------------------------------
Ran 1 test in 0.000s

OK
test_cr_lf (tstorm.tests.utilities.UtilitiesTest) ... ok
test_srm_transfer_outbound_http (tstorm.tests.https.HttpsTest) ... ok
test_direct_transfer_outbound_http (tstorm.tests.https.HttpsTest) ... ok
test_direct_transfer_outbound_http_exist_file (tstorm.tests.https.HttpsTest) ... ok
test_direct_transfer_inbound_http (tstorm.tests.https.HttpsTest) ... ok
test_direct_transfer_inbound_http_unexist_file (tstorm.tests.https.HttpsTest) ... ok
test_srm_transfer_inbound_http (tstorm.tests.https.HttpsTest) ... ok
test_rm_lf (tstorm.tests.utilities.UtilitiesTest) ... ok

----------------------------------------------------------------------
Ran 8 tests in 3.879s

OK
test_cr_lf (tstorm.tests.utilities.UtilitiesTest) ... ok
test_srm_transfer_outbound_https (tstorm.tests.https.HttpsTest) ... ok
test_direct_transfer_outbound_https (tstorm.tests.https.HttpsTest) ... ok
test_direct_transfer_outbound_https_exist_file (tstorm.tests.https.HttpsTest) ... ok
test_direct_transfer_inbound_https (tstorm.tests.https.HttpsTest) ... ADD UID for test_direct_transfer_inbound_https
ok
test_direct_transfer_inbound_https_no_auth (tstorm.tests.https.HttpsTest) ... ok
test_direct_transfer_inbound_https_unexist_file (tstorm.tests.https.HttpsTest) ... ok
test_srm_transfer_inbound_https (tstorm.tests.https.HttpsTest) ... ok
test_rm_lf (tstorm.tests.utilities.UtilitiesTest) ... ok

----------------------------------------------------------------------
Ran 9 tests in 3.379s

OK
test_get_space_metadata_failure (tstorm.tests.regression.RegressionTest) ... ok

----------------------------------------------------------------------
Ran 1 test in 0.100s

OK

Complete log file are here

Regression tests

Not Possible (Task is incompleted)

-- SergioTraldi - 2012-04-26

 
This site is powered by the TWiki collaboration platformCopyright © 2008-2019 by the contributing authors. All material on this collaboration platform is the property of the contributing authors.
Ideas, requests, problems regarding TWiki? Send feedback