Difference: WMS364TestReport (8 vs. 9)

Revision 92014-03-27 - FabioCapannini

Line: 1 to 1
 
META TOPICPARENT name="IGITestCert"

WMS 3.6.4 test report - IGIRTC-175

Line: 623 to 623
 
Added:
>
>

Regression tests - SOME FAILURES

[capannini@emitestbed54 regression]$ pybot -e 85071 ~/git/WMS-Test-Suite/robot_testsuites/regression_tests/testsuites/
==============================================================================
Testsuites                                                                    
==============================================================================
Testsuites.100176 :: classad plugin functions are broken                      
==============================================================================
bug 100176                                                            | PASS |
------------------------------------------------------------------------------
Testsuites.100176 :: classad plugin functions are broken              | PASS |
1 critical test, 1 passed, 0 failed
1 test total, 1 passed, 0 failed
==============================================================================
Testsuites.27215 :: WM to set the maximum output sandbox size                 
==============================================================================
[ WARN ] Job finishes with status Cancelled cannont retrieve output           
bug 27215                                                             | FAIL |
GeneralError: 'Job finishes with status: Cancelled cannot retrieve output'
------------------------------------------------------------------------------
Testsuites.27215 :: WM to set the maximum output sandbox size         | FAIL |
1 critical test, 0 passed, 1 failed
1 test total, 0 passed, 1 failed
==============================================================================
Testsuites.27899 :: VO override does not work with JdlDefaultAttributes       
==============================================================================
bug 27899                                                             | FAIL |
GeneralError: 'Error description => Authentication failed.'
------------------------------------------------------------------------------
Testsuites.27899 :: VO override does not work with JdlDefaultAttri... | FAIL |
1 critical test, 0 passed, 1 failed
1 test total, 0 passed, 1 failed
==============================================================================
Testsuites.28235 :: Previously used CEs are not considered at all in the re...
==============================================================================
bug 28235                                                             | FAIL |
GeneralError: 'Error !!! Job status is not Aborted'
------------------------------------------------------------------------------
Testsuites.28235 :: Previously used CEs are not considered at all ... | FAIL |
1 critical test, 0 passed, 1 failed
1 test total, 0 passed, 1 failed
==============================================================================
Testsuites.28637 :: Delegation IDs not found when CREAM persistence storage...
==============================================================================
bug 28637                                                             | FAIL |
GeneralError: 'Error while executing remote command => mysql -u test --password=c6ocfai! delegationdb < /root/test.sql'
------------------------------------------------------------------------------
Testsuites.28637 :: Delegation IDs not found when CREAM persistenc... | FAIL |
1 critical test, 0 passed, 1 failed
1 test total, 0 passed, 1 failed
==============================================================================
Testsuites.28642 :: User environment breaks WMS wrapper                       
==============================================================================
bug 28642                                                             | FAIL |
GeneralError: 'Timeout reached while waiting the job https://emitestbed44.cnaf.infn.it:9000/GZjeRVi0N0oyAC7kcGFGwA to finish'
------------------------------------------------------------------------------
Testsuites.28642 :: User environment breaks WMS wrapper               | FAIL |
1 critical test, 0 passed, 1 failed
1 test total, 0 passed, 1 failed
==============================================================================
Testsuites.30896 :: WMS must limit number of files per sandbox                
==============================================================================
bug 30896                                                             | FAIL |
GeneralError: '\nError - Operation failed\nUnable to find any endpoint where to perform service request\n'
------------------------------------------------------------------------------
Testsuites.30896 :: WMS must limit number of files per sandbox        | FAIL |
1 critical test, 0 passed, 1 failed
1 test total, 0 passed, 1 failed
==============================================================================
Testsuites.30900 :: MinPerusalTimeInterval default is too low                 
==============================================================================
bug 30900                                                             | PASS |
------------------------------------------------------------------------------
Testsuites.30900 :: MinPerusalTimeInterval default is too low         | PASS |
1 critical test, 1 passed, 0 failed
1 test total, 1 passed, 0 failed
==============================================================================
Testsuites.31012 :: WMS Client does not print properly WMProxy server version 
==============================================================================
bug 31012                                                             | FAIL |
GeneralError: '-----------------------------------------\n26 March 2014, 18:23:48 -I- PID: 6259 (Debug) - Vo read from proxy certificate extension\n-----------------------------------------\n-----------------------------------------\n26 March 2014, 18:23:48 -I- PID: 6259 (Debug) - VirtualOrganisation value : testers.eu-emi.eu\n-----------------------------------------\n-----------------------------------------\n26 March 2014, 18:23:48 -I- PID: 6259 (Debug) - Loaded user configuration file:\n /home/capannini/certificazione/WMSTaskIGIRTC175/regression/regression-tests_Testsuites.31012_20140326182348/wms.conf\n-----------------------------------------\n-----------------------------------------\n26 March 2014, 18:23:48 -I- PID: 6259 (Debug) - Configuration file: //etc/glite-wms/testers.eu-emi.eu/glite_wmsui.conf - VirtualOrganisation, MyProxyServer attribute(s) no more supported outside JDL Default Attributes section "JdlDefaultAttributes"\n-----------------------------------------\n-----------------------------------------\n26 March 2014, 18:23:48 -I- PID: 6259 (Debug) - Loaded Vo specific configuration file:\n //etc/glite-wms/testers.eu-emi.eu/glite_wmsui.conf\n-----------------------------------------\n-----------------------------------------\n26 March 2014, 18:23:48 -I- PID: 6259 (Debug) - Loaded Configuration values: \n [\n  JdlDefaultAttributes = \n   [\n    SignificantAttributes = { "Requirements","Rank" }; \n    VirtualOrganisation = "testers.eu-emi.eu"; \n    Rank =  -other.GlueCEStateEstimatedResponseTime; \n    Requirements = other.GlueCEStateStatus == "Production"\n   ]; \n  OutputStorage = "/tmp/jobOutput"; \n  ListenerStorage = "/tmp"; \n  ErrorStorage = "/tmp"; \n  WmProxyEndPoints = { "https://emitestbed44.cnaf.infn.it:7443/glite_wms_wmproxy_server" }\n ]\n-----------------------------------------\n\nWMS User Interface version  3.5.1\nCopyright (C) 2008 by ElsagDatamat SpA\n\n-----------------------------------------\n26 March 2014, 18:23:48 -I- PID: 6259 (Debug) - Getting Endpoint URL from configuration file \n-----------------------------------------\n\nConnecting to the service https://emitestbed44.cnaf.infn.it:7443/glite_wms_wmproxy_server\n\n-----------------------------------------\n26 March 2014, 18:23:48 -I- PID: 6259 (Debug) - Calling the WMProxy getVersion service\n-----------------------------------------\n\nConnection failed: CA certificate verification failed\n\n\n-----------------------------------------\n26 March 2014, 18:23:52 -I- PID: 6259 (Debug) - Skip Service Discovery query: disabled by user configuration settings \n-----------------------------------------\n\nError - Operation failed\nUnable to find any endpoint where to perform service request\n\n\nPossible Errors and Debug messages have been printed in the following file:\n/tmp/glite-wms-job-submit_501_6259_20140326_18-23-48.log\n'
------------------------------------------------------------------------------
Testsuites.31012 :: WMS Client does not print properly WMProxy ser... | FAIL |
1 critical test, 0 passed, 1 failed
1 test total, 0 passed, 1 failed
==============================================================================
Testsuites.31278 :: WMS should prevent non-SDJ jobs from being scheduled on...
==============================================================================
bug 31278                                                             | PASS |
------------------------------------------------------------------------------
Testsuites.31278 :: WMS should prevent non-SDJ jobs from being sch... | PASS |
1 critical test, 1 passed, 0 failed
1 test total, 1 passed, 0 failed
==============================================================================
Testsuites.31669 :: org.glite.jdl.api-cpp: defaultNode[Shallow]RetryCount a...
==============================================================================
bug 31669                                                             | PASS |
------------------------------------------------------------------------------
Testsuites.31669 :: org.glite.jdl.api-cpp: defaultNode[Shallow]Ret... | PASS |
1 critical test, 1 passed, 0 failed
1 test total, 1 passed, 0 failed
==============================================================================
Testsuites.32078 :: Problem with GangMatching statement involving GlueSEStatus
==============================================================================
bug 32078                                                             | FAIL |
GeneralError: "lcg-infosites: no BDII could be contacted\nlcg-infosites: last BDII tried was 'certtbrc-bdii.cern.ch:2170'\nlcg-infosites: IO::Socket::INET: Bad hostname 'certtbrc-bdii.cern.ch:2170'"
------------------------------------------------------------------------------
Testsuites.32078 :: Problem with GangMatching statement involving ... | FAIL |
1 critical test, 0 passed, 1 failed
1 test total, 0 passed, 1 failed
==============================================================================
Testsuites.32611 :: JobController logfile name is misspelled                  
==============================================================================
bug 32611                                                             | PASS |
------------------------------------------------------------------------------
Testsuites.32611 :: JobController logfile name is misspelled          | PASS |
1 critical test, 1 passed, 0 failed
1 test total, 1 passed, 0 failed
==============================================================================
Testsuites.34420 :: WMS Client: glite-wms-job-submit option --valid does no...
==============================================================================
bug 34420                                                             | PASS |
------------------------------------------------------------------------------
Testsuites.34420 :: WMS Client: glite-wms-job-submit option --vali... | PASS |
1 critical test, 1 passed, 0 failed
1 test total, 1 passed, 0 failed
==============================================================================
Testsuites.34508 :: Any collection submitted while the WMS is down is not r...
==============================================================================
bug 34508                                                             | FAIL |
GeneralError: "Job not finished successfully. Job final status is 'Cleared' instead of 'Done (Success)'"
------------------------------------------------------------------------------
Testsuites.34508 :: Any collection submitted while the WMS is down... | FAIL |
1 critical test, 0 passed, 1 failed
1 test total, 0 passed, 1 failed
==============================================================================
Testsuites.35250 :: DAG: glite_wms_wmproxy_dirmanager does not extract link...
==============================================================================
bug 35250                                                             | FAIL |
GeneralError: 'Timeout reached while waiting the job https://emitestbed44.cnaf.infn.it:9000/OenzbHQNipduqAKUEiuz7g to finish'
------------------------------------------------------------------------------
Testsuites.35250 :: DAG: glite_wms_wmproxy_dirmanager does not ext... | FAIL |
1 critical test, 0 passed, 1 failed
1 test total, 0 passed, 1 failed
==============================================================================
Testsuites.36145 :: Jobdir support to be enabled in the glite-wms-planner     
==============================================================================
bug 36145                                                             | FAIL |
GeneralError: 'Error while edit file /etc/glite-wms/glite_wms.conf at remote host'
------------------------------------------------------------------------------
Testsuites.36145 :: Jobdir support to be enabled in the glite-wms-... | FAIL |
1 critical test, 0 passed, 1 failed
1 test total, 0 passed, 1 failed
==============================================================================
Testsuites.36292 :: Not all attributes of a SA/SE coul be used in a gangmat...
==============================================================================
bug 36292                                                             | FAIL |
GeneralError: "lcg-infosites: no BDII could be contacted\nlcg-infosites: last BDII tried was 'certtbrc-bdii.cern.ch:2170'\nlcg-infosites: IO::Socket::INET: Bad hostname 'certtbrc-bdii.cern.ch:2170'"
------------------------------------------------------------------------------
Testsuites.36292 :: Not all attributes of a SA/SE coul be used in ... | FAIL |
1 critical test, 0 passed, 1 failed
1 test total, 0 passed, 1 failed
==============================================================================
Testsuites.36536 :: The glite wms purge storage library should rely on LBPr...
==============================================================================
bug 36536                                                             | FAIL |
GeneralError: 'To verify this bug it is necessary to set WMS_USERNAME,WMS_PASSWORD,USERNAME and PASSWORD in the configuration file'
------------------------------------------------------------------------------
Testsuites.36536 :: The glite wms purge storage library should rel... | FAIL |
1 critical test, 0 passed, 1 failed
1 test total, 0 passed, 1 failed
==============================================================================
Testsuites.38359 :: Title: Some issues in the limit for the output sandbox ...
==============================================================================
[ WARN ] Job finishes with status Cancelled cannont retrieve output           
bug 38359                                                             | FAIL |
GeneralError: 'Job finishes with status: Cancelled cannot retrieve output'
------------------------------------------------------------------------------
Testsuites.38359 :: Title: Some issues in the limit for the output... | FAIL |
1 critical test, 0 passed, 1 failed
1 test total, 0 passed, 1 failed
==============================================================================
Testsuites.38739 :: WMProxy Server: doesn't allow exec if there's only user...
==============================================================================
bug 38739                                                             | FAIL |
GeneralError: '\nConnecting to the service https://emitestbed44.cnaf.infn.it:7443/glite_wms_wmproxy_server\n\n\nConnection failed: CA certificate verification failed\n\n\n\nError - Operation failed\nUnable to find any endpoint where to perform service request\n'
------------------------------------------------------------------------------
Testsuites.38739 :: WMProxy Server: doesn't allow exec if there's ... | FAIL |
1 critical test, 0 passed, 1 failed
1 test total, 0 passed, 1 failed
==============================================================================
Testsuites.40982 :: When a collection is aborted the "Abort" event should b...
==============================================================================
bug 40982                                                             | FAIL |
GeneralError: "\nError - \nInputSandbox: Specified path 'data/Test.sh' is missing\n"
------------------------------------------------------------------------------
Testsuites.40982 :: When a collection is aborted the "Abort" event... | FAIL |
1 critical test, 0 passed, 1 failed
1 test total, 0 passed, 1 failed
==============================================================================
Testsuites.44599 :: WMS should consider MaxTotalJobs                          
==============================================================================
bug 44599                                                             | FAIL |
GeneralError: "\nError - \nInputSandbox: Specified path 'data/input1.txt' is missing\n"
------------------------------------------------------------------------------
Testsuites.44599 :: WMS should consider MaxTotalJobs                  | FAIL |
1 critical test, 0 passed, 1 failed
1 test total, 0 passed, 1 failed
==============================================================================
Testsuites.45883 :: Optimization of resubmission                              
==============================================================================
bug 45883                                                             | FAIL |
GeneralError: 'Error !!! Job status is not Aborted'
------------------------------------------------------------------------------
Testsuites.45883 :: Optimization of resubmission                      | FAIL |
1 critical test, 0 passed, 1 failed
1 test total, 0 passed, 1 failed
==============================================================================
Testsuites.48068 :: [wms] GlueServiceStatusInfo content is ugly               
==============================================================================
bug 48068                                                             | FAIL |
GeneralError: "Test failed, command's output wasn't as expected"
------------------------------------------------------------------------------
Testsuites.48068 :: [wms] GlueServiceStatusInfo content is ugly       | FAIL |
1 critical test, 0 passed, 1 failed
1 test total, 0 passed, 1 failed
==============================================================================
Testsuites.48636 :: job wrapper should log events for truncated files         
==============================================================================
bug 48636                                                             | FAIL |
GeneralError: "Not found message 'OSB quota exceeded for' at UserTag"
------------------------------------------------------------------------------
Testsuites.48636 :: job wrapper should log events for truncated files | FAIL |
1 critical test, 0 passed, 1 failed
1 test total, 0 passed, 1 failed
==============================================================================
Testsuites.50009 :: wmproxy.gacl person record allows anyone to pass          
==============================================================================
bug 50009                                                             | PASS |
------------------------------------------------------------------------------
Testsuites.50009 :: wmproxy.gacl person record allows anyone to pass  | PASS |
1 critical test, 1 passed, 0 failed
1 test total, 1 passed, 0 failed
==============================================================================
Testsuites.52617 :: [yaim-wms] yaim changes ownership of /var                 
==============================================================================
bug 52617                                                             | FAIL |
GeneralError: 'Error while executing remote command => ls -l /home/glite'
------------------------------------------------------------------------------
Testsuites.52617 :: [yaim-wms] yaim changes ownership of /var         | FAIL |
1 critical test, 0 passed, 1 failed
1 test total, 0 passed, 1 failed
==============================================================================
Testsuites.53294 :: WMS 3.2 WMProxy logs are useless below level 6            
==============================================================================
bug 53294                                                             | PASS |
------------------------------------------------------------------------------
Testsuites.53294 :: WMS 3.2 WMProxy logs are useless below level 6    | PASS |
1 critical test, 1 passed, 0 failed
1 test total, 1 passed, 0 failed
==============================================================================
Testsuites.54728 :: WMP finds FQAN inconsistency only if GROUPS are differe...
==============================================================================
bug 54728                                                             | FAIL |
GeneralError: 'Contacting emitestbed07.cnaf.infn.it:15002 [/C=IT/O=INFN/OU=Host/L=CNAF/CN=emitestbed07.cnaf.infn.it] "testers.eu-emi.eu"...\nRemote VOMS server contacted succesfully.\n\nVOMS server emitestbed07.cnaf.infn.it:15002 returned the following errors:\ntesters.eu-emi.eu: Unable to satisfy B/testers.eu-emi.eu:pilot Request!\nUser\'s request for VOMS attributes could not be fulfilled.'
------------------------------------------------------------------------------
Testsuites.54728 :: WMP finds FQAN inconsistency only if GROUPS ar... | FAIL |
1 critical test, 0 passed, 1 failed
1 test total, 0 passed, 1 failed
==============================================================================
Testsuites.55814 :: the amount of information logged to the LB needs to be ...
==============================================================================
bug 55814                                                             | FAIL |
GeneralError: 'Error while executing remote command => ls -l /var/jobcontrol/submit/Km'
------------------------------------------------------------------------------
Testsuites.55814 :: the amount of information logged to the LB nee... | FAIL |
1 critical test, 0 passed, 1 failed
1 test total, 0 passed, 1 failed
==============================================================================
Testsuites.56734 :: ListMatch should consider also SDJ specification          
==============================================================================
bug 56734                                                             | FAIL |
GeneralError: 'Timeout reached while waiting the job https://emitestbed44.cnaf.infn.it:9000/u2dvak1JY-T1NBRRb8479g to finish'
------------------------------------------------------------------------------
Testsuites.56734 :: ListMatch should consider also SDJ specification  | FAIL |
1 critical test, 0 passed, 1 failed
1 test total, 0 passed, 1 failed
==============================================================================
Testsuites.58878 :: Request for a feature allowing propagation of generic p...
==============================================================================
[ WARN ] Error !!! Matching CE is                                             
bug 58878                                                             | FAIL |
GeneralError: '\nError - Cancel not allowed\nCurrent Job Status is Aborted\n'
------------------------------------------------------------------------------
Testsuites.58878 :: Request for a feature allowing propagation of ... | FAIL |
1 critical test, 0 passed, 1 failed
1 test total, 0 passed, 1 failed
==============================================================================
Testsuites.58968 :: Request for handling SMPGranularity attribute in the JDL  
==============================================================================
bug 58968                                                             | PASS |
------------------------------------------------------------------------------
Testsuites.58968 :: Request for handling SMPGranularity attribute ... | PASS |
1 critical test, 1 passed, 0 failed
1 test total, 1 passed, 0 failed
==============================================================================
Testsuites.61315 :: [ yaim-wms ] CeForwardParameters should include several...
==============================================================================
bug 61315                                                             | PASS |
------------------------------------------------------------------------------
Testsuites.61315 :: [ yaim-wms ] CeForwardParameters should includ... | PASS |
1 critical test, 1 passed, 0 failed
1 test total, 1 passed, 0 failed
==============================================================================
Testsuites.62211 :: [ yaim-wms ] Enable Glue 2.0 publishing                   
==============================================================================
bug 62211                                                             | FAIL |
GeneralError: 'sh: svn: command not found'
------------------------------------------------------------------------------
Testsuites.62211 :: [ yaim-wms ] Enable Glue 2.0 publishing           | FAIL |
1 critical test, 0 passed, 1 failed
1 test total, 0 passed, 1 failed
==============================================================================
Testsuites.64416 :: The proxycache purger needs to be made compatible with ...
==============================================================================
bug 64416                                                             | FAIL |
GeneralError: 'Error while executing remote command => find /var/proxycache -name *.pem'
------------------------------------------------------------------------------
Testsuites.64416 :: The proxycache purger needs to be made compati... | FAIL |
1 critical test, 0 passed, 1 failed
1 test total, 0 passed, 1 failed
==============================================================================
Testsuites.67489 :: WMS needs cron job to kill stale GridFTP processes        
==============================================================================
bug 67489                                                             | PASS |
------------------------------------------------------------------------------
Testsuites.67489 :: WMS needs cron job to kill stale GridFTP proce... | PASS |
1 critical test, 1 passed, 0 failed
1 test total, 1 passed, 0 failed
==============================================================================
Testsuites.68944 :: Bug in ICE's start/stop script                            
==============================================================================
bug 68944                                                             | PASS |
------------------------------------------------------------------------------
Testsuites.68944 :: Bug in ICE's start/stop script                    | PASS |
1 critical test, 1 passed, 0 failed
1 test total, 1 passed, 0 failed
==============================================================================
Testsuites.70061 :: WMS hates collections with 192 nodes!                     
==============================================================================
bug 70061                                                             | PASS |
------------------------------------------------------------------------------
Testsuites.70061 :: WMS hates collections with 192 nodes!             | PASS |
1 critical test, 1 passed, 0 failed
1 test total, 1 passed, 0 failed
==============================================================================
Testsuites.70331 :: glite-wms-create-proxy "ambiguous redirect"               
==============================================================================
bug 70331                                                             | PASS |
------------------------------------------------------------------------------
Testsuites.70331 :: glite-wms-create-proxy "ambiguous redirect"       | PASS |
1 critical test, 1 passed, 0 failed
1 test total, 1 passed, 0 failed
==============================================================================
Testsuites.70824 :: Environment values in JDL cannot have spaces              
==============================================================================
[ WARN ] Job finishes with status Cancelled cannont retrieve output           
bug 70824                                                             
 Test for CE: /cream- 

bug 70824                                                             | FAIL |
GeneralError: 'Job finishes with status: Cancelled cannot retrieve output'
------------------------------------------------------------------------------
Testsuites.70824 :: Environment values in JDL cannot have spaces      | FAIL |
1 critical test, 0 passed, 1 failed
1 test total, 0 passed, 1 failed
==============================================================================
Testsuites.71863 :: JobWrapper tries to use "test -eq" for string comparison  
==============================================================================
bug 71863                                                             | PASS |
------------------------------------------------------------------------------
Testsuites.71863 :: JobWrapper tries to use "test -eq" for string ... | PASS |
1 critical test, 1 passed, 0 failed
1 test total, 1 passed, 0 failed
==============================================================================
Testsuites.72280 :: WMProxy limiter should log more at info level             
==============================================================================
bug 72280                                                             | FAIL |
GeneralError: 'Error while transfer file /var/log/wms/wmproxy.log from remote host'
------------------------------------------------------------------------------
Testsuites.72280 :: WMProxy limiter should log more at info level     | FAIL |
1 critical test, 0 passed, 1 failed
1 test total, 0 passed, 1 failed
==============================================================================
Testsuites.73192 :: Submission failed due to a credential problem             
==============================================================================
bug 73192                                                             | FAIL |
GeneralError: '\nError - Operation failed\nUnable to find any endpoint where to perform service request\n'
------------------------------------------------------------------------------
Testsuites.73192 :: Submission failed due to a credential problem     | FAIL |
1 critical test, 0 passed, 1 failed
1 test total, 0 passed, 1 failed
==============================================================================
Testsuites.73699 :: Wrong retry count computation                             
==============================================================================
bug 73699                                                             | FAIL |
GeneralError: '\nError - Operation failed\nUnable to find any endpoint where to perform service request\n'
------------------------------------------------------------------------------
Testsuites.73699 :: Wrong retry count computation                     | FAIL |
1 critical test, 0 passed, 1 failed
1 test total, 0 passed, 1 failed
==============================================================================
Testsuites.73711 :: edg_wll_SetLoggingJobProxy with empty sequence code ret...
==============================================================================
[ WARN ] To verify this bug you need a WMS set in proxy mode only             
bug 73711                                                             | FAIL |
GeneralError: '\nError - Operation failed\nUnable to find any endpoint where to perform service request\n'
------------------------------------------------------------------------------
Testsuites.73711 :: edg_wll_SetLoggingJobProxy with empty sequence... | FAIL |
1 critical test, 0 passed, 1 failed
1 test total, 0 passed, 1 failed
==============================================================================
Testsuites.73715 :: Missing ReallyRunning event from LogMonitor               
==============================================================================
bug 73715                                                             | FAIL |
GeneralError: '\nError - Operation failed\nUnable to find any endpoint where to perform service request\n'
------------------------------------------------------------------------------
Testsuites.73715 :: Missing ReallyRunning event from LogMonitor       | FAIL |
1 critical test, 0 passed, 1 failed
1 test total, 0 passed, 1 failed
==============================================================================
Testsuites.74259 :: Previous matches information is not taken into account ...
==============================================================================
bug 74259                                                             | FAIL |
GeneralError: '\nError - Operation failed\nUnable to find any endpoint where to perform service request\n'
------------------------------------------------------------------------------
Testsuites.74259 :: Previous matches information is not taken into... | FAIL |
1 critical test, 0 passed, 1 failed
1 test total, 0 passed, 1 failed
==============================================================================
Testsuites.74577 :: Wrong counter in ICE database is set at the job creation  
==============================================================================
bug 74577                                                             | FAIL |
GeneralError: '\nError - Operation failed\nUnable to find any endpoint where to perform service request\n'
------------------------------------------------------------------------------
Testsuites.74577 :: Wrong counter in ICE database is set at the jo... | FAIL |
1 critical test, 0 passed, 1 failed
1 test total, 0 passed, 1 failed
==============================================================================
Testsuites.74832 :: Files specified with absolute paths shouldn't be used w...
==============================================================================
bug 74832                                                             | FAIL |
GeneralError: '-----------------------------------------\n26 March 2014, 23:15:32 -I- PID: 5834 (Debug) - Vo read from proxy certificate extension\n-----------------------------------------\n-----------------------------------------\n26 March 2014, 23:15:32 -I- PID: 5834 (Debug) - VirtualOrganisation value : testers.eu-emi.eu\n-----------------------------------------\n-----------------------------------------\n26 March 2014, 23:15:32 -I- PID: 5834 (Debug) - Loaded user configuration file:\n /home/capannini/certificazione/WMSTaskIGIRTC175/regression/regression-tests_Testsuites.74832_20140326231532/wms.conf\n-----------------------------------------\n-----------------------------------------\n26 March 2014, 23:15:32 -I- PID: 5834 (Debug) - Configuration file: //etc/glite-wms/testers.eu-emi.eu/glite_wmsui.conf - VirtualOrganisation, MyProxyServer attribute(s) no more supported outside JDL Default Attributes section "JdlDefaultAttributes"\n-----------------------------------------\n-----------------------------------------\n26 March 2014, 23:15:32 -I- PID: 5834 (Debug) - Loaded Vo specific configuration file:\n //etc/glite-wms/testers.eu-emi.eu/glite_wmsui.conf\n-----------------------------------------\n-----------------------------------------\n26 March 2014, 23:15:32 -I- PID: 5834 (Debug) - Loaded Configuration values: \n [\n  JdlDefaultAttributes = \n   [\n    SignificantAttributes = { "Requirements","Rank" }; \n    VirtualOrganisation = "testers.eu-emi.eu"; \n    Rank =  -other.GlueCEStateEstimatedResponseTime; \n    Requirements...
    [ Message content over the limit has been removed. ]
...ut.out","error.err","fstab","grid-mapfile","groupmapfile","passwd" }; InputSandbox = { "file:///etc/fstab","grid-mapfile","groupmapfile","gsiftp://emitestbed41.cnaf.infn.it/etc/passwd" }; StdError = "error.err"; InputSandboxBaseURI = "gsiftp://emitestbed41.cnaf.infn.it/etc/grid-security/"; rank =  -other.GlueCEStateEstimatedResponseTime; requirements = other.GlueCEStateStatus == "Production" ]\n-----------------------------------------\n-----------------------------------------\n26 March 2014, 23:15:32 -I- PID: 5834 (Debug) - Registering the job to the service https://emitestbed44.cnaf.infn.it:7443/glite_wms_wmproxy_server\n-----------------------------------------\n-----------------------------------------\n26 March 2014, 23:15:32 -I- PID: 5834 (Debug) - Calling the WMProxy jobRegister service\n-----------------------------------------\n\nWarning - Unable to register the job to the service: https://emitestbed44.cnaf.infn.it:7443/glite_wms_wmproxy_server\nSystem load is too high:\nThreshold for Load Average(1 min): 0.0001 => Detected value for Load Average(1 min):  0.08\n\nError code: SOAP-ENV:Server\n\n-----------------------------------------\n26 March 2014, 23:15:33 -I- PID: 5834 (Debug) - Skip Service Discovery query: disabled by user configuration settings \n-----------------------------------------\n\nError - Operation failed\nUnable to find any endpoint where to perform service request\n\n\nPossible Errors and Debug messages have been printed in the following file:\n/tmp/glite-wms-job-submit_501_5834_20140326_23-15-32.log\n'
------------------------------------------------------------------------------
Testsuites.74832 :: Files specified with absolute paths shouldn't ... | FAIL |
1 critical test, 0 passed, 1 failed
1 test total, 0 passed, 1 failed
==============================================================================
Testsuites.75223 :: wrong reason logged                                       
==============================================================================
bug 75223                                                             | FAIL |
GeneralError: '\nError - Operation failed\nUnable to find any endpoint where to perform service request\n'
------------------------------------------------------------------------------
Testsuites.75223 :: wrong reason logged                               | FAIL |
1 critical test, 0 passed, 1 failed
1 test total, 0 passed, 1 failed
==============================================================================
Testsuites.75368 :: ICE should log a DONE_FAILED to LB every time the job i...
==============================================================================
bug 75368                                                             | FAIL |
GeneralError: '\nError - Operation failed\nUnable to find any endpoint where to perform service request\n'
------------------------------------------------------------------------------
Testsuites.75368 :: ICE should log a DONE_FAILED to LB every time ... | FAIL |
1 critical test, 0 passed, 1 failed
1 test total, 0 passed, 1 failed
==============================================================================
Testsuites.75802 :: Title: Too much flexibility in JDL syntax                 
==============================================================================
bug 75802                                                             | FAIL |
GeneralError: 'Inserting {"FOO=bar"}\n\nError - Operation failed\nUnable to find any endpoint where to perform service request\n'
------------------------------------------------------------------------------
Testsuites.75802 :: Title: Too much flexibility in JDL syntax         | FAIL |
1 critical test, 0 passed, 1 failed
1 test total, 0 passed, 1 failed
==============================================================================
Testsuites.77004 :: Wrong myproxyserver string processing in ICE              
==============================================================================
bug 77004                                                             | FAIL |
GeneralError: '\nError - Operation failed\nUnable to find any endpoint where to perform service request\n'
------------------------------------------------------------------------------
Testsuites.77004 :: Wrong myproxyserver string processing in ICE      | FAIL |
1 critical test, 0 passed, 1 failed
1 test total, 0 passed, 1 failed
==============================================================================
Testsuites.77055 :: "MyProxyServer: wrong type caught for attribute" for pa...
==============================================================================
bug 77055                                                             | FAIL |
GeneralError: '\nError - Operation failed\nUnable to find any endpoint where to perform service request\n'
------------------------------------------------------------------------------
Testsuites.77055 :: "MyProxyServer: wrong type caught for attribut... | FAIL |
1 critical test, 0 passed, 1 failed
1 test total, 0 passed, 1 failed
==============================================================================
Testsuites.77694 :: Resource BDII for WMS needs to be revisit                 
==============================================================================
bug 77694                                                             | PASS |
------------------------------------------------------------------------------
Testsuites.77694 :: Resource BDII for WMS needs to be revisit         | PASS |
1 critical test, 1 passed, 0 failed
1 test total, 1 passed, 0 failed
==============================================================================
Testsuites.77876 :: While purging DAGs/Collections the CLEAR event is only ...
==============================================================================
bug 77876                                                             | FAIL |
GeneralError: '\nError - Operation failed\nUnable to find any endpoint where to perform service request\n'
------------------------------------------------------------------------------
Testsuites.77876 :: While purging DAGs/Collections the CLEAR event... | FAIL |
1 critical test, 0 passed, 1 failed
1 test total, 0 passed, 1 failed
==============================================================================
Testsuites.78047 :: LB Query timeout                                          
==============================================================================
bug 78047                                                             | FAIL |
GeneralError: '\nError - Operation failed\nUnable to find any endpoint where to perform service request\n'
------------------------------------------------------------------------------
Testsuites.78047 :: LB Query timeout                                  | FAIL |
1 critical test, 0 passed, 1 failed
1 test total, 0 passed, 1 failed
==============================================================================
Testsuites.78406 :: [ yaim-wms ] yaim should set IsmIiLDAPCEFilterExt accor...
==============================================================================
bug 78406                                                             | PASS |
------------------------------------------------------------------------------
Testsuites.78406 :: [ yaim-wms ] yaim should set IsmIiLDAPCEFilter... | PASS |
1 critical test, 1 passed, 0 failed
1 test total, 1 passed, 0 failed
==============================================================================
Testsuites.78484 :: [ YAIM_WMS ] Multiple parameter configuration added in ...
==============================================================================
bug 78484                                                             | FAIL |
GeneralError: 'Error while executing remote command => cat /opt/condor-c/local.emitestbed44/condor_config.local'
------------------------------------------------------------------------------
Testsuites.78484 :: [ YAIM_WMS ] Multiple parameter configuration ... | FAIL |
1 critical test, 0 passed, 1 failed
1 test total, 0 passed, 1 failed
==============================================================================
Testsuites.79141 :: various bugs about parametric jobs                        
==============================================================================
bug 79141                                                             | FAIL |
GeneralError: "\nError - \nInputSandbox: Specified path 'data/79141/Test0' is missing\n"
------------------------------------------------------------------------------
Testsuites.79141 :: various bugs about parametric jobs                | FAIL |
1 critical test, 0 passed, 1 failed
1 test total, 0 passed, 1 failed
==============================================================================
Testsuites.81376 :: glite-wms-wmproxy.restart.cron MUST support graceful wm...
==============================================================================
bug 81376                                                             | PASS |
------------------------------------------------------------------------------
Testsuites.81376 :: glite-wms-wmproxy.restart.cron MUST support gr... | PASS |
1 critical test, 1 passed, 0 failed
1 test total, 1 passed, 0 failed
==============================================================================
Testsuites.81568 :: some inconsistencies in locations for logs and configur...
==============================================================================
bug 81568                                                             | FAIL |
GeneralError: 'Error !!! Environment  variable WMS_LOCATION_LOG is /var/log/wms instead of /var/log/glite'
------------------------------------------------------------------------------
Testsuites.81568 :: some inconsistencies in locations for logs and... | FAIL |
1 critical test, 0 passed, 1 failed
1 test total, 0 passed, 1 failed
==============================================================================
Testsuites.81651 :: Cancellation of a dag's node doesn't work                 
==============================================================================
bug 81651                                                             | FAIL |
GeneralError: '\nError - Operation failed\nUnable to find any endpoint where to perform service request\n'
------------------------------------------------------------------------------
Testsuites.81651 :: Cancellation of a dag's node doesn't work         | FAIL |
1 critical test, 0 passed, 1 failed
1 test total, 0 passed, 1 failed
==============================================================================
Testsuites.82687 :: EMI WMS problems with ISB tar file handling               
==============================================================================
bug 82687                                                             | FAIL |
GeneralError: '\nError - Operation failed\nUnable to find any endpoint where to perform service request\n'
------------------------------------------------------------------------------
Testsuites.82687 :: EMI WMS problems with ISB tar file handling       | FAIL |
1 critical test, 0 passed, 1 failed
1 test total, 0 passed, 1 failed
==============================================================================
Testsuites.82776 :: Typo in WMS jobwrapper                                    
==============================================================================
bug 82776                                                             | PASS |
------------------------------------------------------------------------------
Testsuites.82776 :: Typo in WMS jobwrapper                            | PASS |
1 critical test, 1 passed, 0 failed
1 test total, 1 passed, 0 failed
==============================================================================
Testsuites.82983 :: [yaim-wms] authorization problem in WMS EMI-1             
==============================================================================
bug 82983                                                             | PASS |
------------------------------------------------------------------------------
Testsuites.82983 :: [yaim-wms] authorization problem in WMS EMI-1     | PASS |
1 critical test, 1 passed, 0 failed
1 test total, 1 passed, 0 failed
==============================================================================
Testsuites.82995 :: glite-wms-job-status needs a json-compliant format        
==============================================================================
bug 82995                                                             | FAIL |
GeneralError: '\nError - Operation failed\nUnable to find any endpoint where to perform service request\n'
------------------------------------------------------------------------------
Testsuites.82995 :: glite-wms-job-status needs a json-compliant fo... | FAIL |
1 critical test, 0 passed, 1 failed
1 test total, 0 passed, 1 failed
==============================================================================
Testsuites.83062 :: [yaim-wms] A different template should be used for glue...
==============================================================================
bug 83062                                                             | FAIL |
GeneralError: 'sh: svn: command not found'
------------------------------------------------------------------------------
Testsuites.83062 :: [yaim-wms] A different template should be used... | FAIL |
1 critical test, 0 passed, 1 failed
1 test total, 0 passed, 1 failed
==============================================================================
Testsuites.83453 :: Deregistration of a proxy (2)                             
==============================================================================
bug 83453                                                             | FAIL |
GeneralError: '\nError - Operation failed\nUnable to find any endpoint where to perform service request\n'
------------------------------------------------------------------------------
Testsuites.83453 :: Deregistration of a proxy (2)                     | FAIL |
1 critical test, 0 passed, 1 failed
1 test total, 0 passed, 1 failed
==============================================================================
Testsuites.84155 :: Internal proxy structure convertion error in ICE          
==============================================================================
bug 84155                                                             | FAIL |
GeneralError: '\nError - Operation failed\nUnable to find any endpoint where to perform service request\n'
------------------------------------------------------------------------------
Testsuites.84155 :: Internal proxy structure convertion error in ICE  | FAIL |
1 critical test, 0 passed, 1 failed
1 test total, 0 passed, 1 failed
==============================================================================
Testsuites.84839 :: Last LB event logged by ICE when job aborted for proxy ...
==============================================================================
bug 84839                                                             | FAIL |
GeneralError: '\nError - Operation failed\nUnable to find any endpoint where to perform service request\n'
------------------------------------------------------------------------------
Testsuites.84839 :: Last LB event logged by ICE when job aborted f... | FAIL |
1 critical test, 0 passed, 1 failed
1 test total, 0 passed, 1 failed
==============================================================================
Testsuites.85327 :: [yaim-wms] yaim changes ownership of /var                 
==============================================================================
bug 85327                                                             | PASS |
------------------------------------------------------------------------------
Testsuites.85327 :: [yaim-wms] yaim changes ownership of /var         | PASS |
1 critical test, 1 passed, 0 failed
1 test total, 1 passed, 0 failed
==============================================================================
Testsuites.85799 :: [ yaim-wms ] yaim should set IsmIiLDAPCEFilterExt accor...
==============================================================================
bug 85799                                                             | FAIL |
GeneralError: 'Unable to find wmproxy-api-cpp.pc file'
------------------------------------------------------------------------------
Testsuites.85799 :: [ yaim-wms ] yaim should set IsmIiLDAPCEFilter... | FAIL |
1 critical test, 0 passed, 1 failed
1 test total, 0 passed, 1 failed
==============================================================================
Testsuites.86267 :: queryDb has 2 bugs handling user options (see ggus tick...
==============================================================================
bug 86267                                                             | PASS |
------------------------------------------------------------------------------
Testsuites.86267 :: queryDb has 2 bugs handling user options (see ... | PASS |
1 critical test, 1 passed, 0 failed
1 test total, 1 passed, 0 failed
==============================================================================
Testsuites.86485 :: ICE doesn't send the iceId to CREAM                       
==============================================================================
[ WARN ] To verify this bug you need access to a CREAM CE and to WMS          
bug 86485                                                             | FAIL |
GeneralError: 'To verify this bug it is necessary to set WMS_USERNAME,WMS_PASSWORD,OTHER_HOST,USERNAME and PASSWORD in the configuration file'
------------------------------------------------------------------------------
Testsuites.86485 :: ICE doesn't send the iceId to CREAM               | FAIL |
1 critical test, 0 passed, 1 failed
1 test total, 0 passed, 1 failed
==============================================================================
Testsuites.86490 :: EMI WMS stops accepting jobs after 31999th submission f...
==============================================================================
bug 86490                                                             | FAIL |
GeneralError: 'Error while executing remote command => find /var/proxycache/ -name *.pem'
------------------------------------------------------------------------------
Testsuites.86490 :: EMI WMS stops accepting jobs after 31999th sub... | FAIL |
1 critical test, 0 passed, 1 failed
1 test total, 0 passed, 1 failed
==============================================================================
Testsuites.86682 :: [yaim-wms] yaim changes ownership of /var                 
==============================================================================
bug 86682                                                             | PASS |
------------------------------------------------------------------------------
Testsuites.86682 :: [yaim-wms] yaim changes ownership of /var         | PASS |
1 critical test, 1 passed, 0 failed
1 test total, 1 passed, 0 failed
==============================================================================
Testsuites.87259 :: WMS purger leaves sandboxes untouched in case LB status...
==============================================================================
bug 87259                                                             | FAIL |
GeneralError: '\nError - Operation failed\nUnable to find any endpoint where to perform service request\n'
------------------------------------------------------------------------------
Testsuites.87259 :: WMS purger leaves sandboxes untouched in case ... | FAIL |
1 critical test, 0 passed, 1 failed
1 test total, 0 passed, 1 failed
==============================================================================
Testsuites.87261 :: WMproxy GACLs do not support wildcards (as they used to...
==============================================================================
bug 87261                                                             | FAIL |
GeneralError: '\nConnecting to the service https://emitestbed44.cnaf.infn.it:7443/glite_wms_wmproxy_server\n\n\nConnection failed: CA certificate verification failed\n\n\n\nError - Operation failed\nUnable to find any endpoint where to perform service request\n'
------------------------------------------------------------------------------
Testsuites.87261 :: WMproxy GACLs do not support wildcards (as the... | FAIL |
1 critical test, 0 passed, 1 failed
1 test total, 0 passed, 1 failed
==============================================================================
Testsuites.87444 :: glite-wms-job-list-match --help show an un-implemented ...
==============================================================================
bug 87444                                                             | PASS |
------------------------------------------------------------------------------
Testsuites.87444 :: glite-wms-job-list-match --help show an un-imp... | PASS |
1 critical test, 1 passed, 0 failed
1 test total, 1 passed, 0 failed
==============================================================================
Testsuites.87994 :: yaim-wms doesn't fill the attributes get_acbr and get_o...
==============================================================================
bug 87994                                                             | FAIL |
GeneralError: 'To verify this bug it is necessary to set the YAIM_FILE in the configuration file'
------------------------------------------------------------------------------
Testsuites.87994 :: yaim-wms doesn't fill the attributes get_acbr ... | FAIL |
1 critical test, 0 passed, 1 failed
1 test total, 0 passed, 1 failed
==============================================================================
Testsuites.88072 :: EMI-1 WMS cannot submit to ARC CEs                        
==============================================================================
bug 88072                                                             | FAIL |
GeneralError: '\nError - Operation failed\nUnable to find any endpoint where to perform service request\n'
------------------------------------------------------------------------------
Testsuites.88072 :: EMI-1 WMS cannot submit to ARC CEs                | FAIL |
1 critical test, 0 passed, 1 failed
1 test total, 0 passed, 1 failed
==============================================================================
Testsuites.88128 :: Submission with rfc proxy doesn't work                    
==============================================================================
bug 88128                                                             | FAIL |
GeneralError: '\nError - Operation failed\nUnable to find any endpoint where to perform service request\n'
------------------------------------------------------------------------------
Testsuites.88128 :: Submission with rfc proxy doesn't work            | FAIL |
1 critical test, 0 passed, 1 failed
1 test total, 0 passed, 1 failed
==============================================================================
Testsuites.88450 :: Ice configuration section doesn't use environment variable
==============================================================================
bug 88450                                                             | FAIL |
GeneralError: 'Problem with the following attributes in the ICE section:set([\'ice_host_cert   =   "${GLITE_HOST_CERT};\', \'ice_host_cert   =   "${GLITE_HOST_CERT}";\', \'ice_host_key   =   "${GLITE_HOST_KEY}";\', \'ice_host_key   =   "${GLITE_HOST_KEY};\'])'
------------------------------------------------------------------------------
Testsuites.88450 :: Ice configuration section doesn't use environm... | FAIL |
1 critical test, 0 passed, 1 failed
1 test total, 0 passed, 1 failed
==============================================================================
Testsuites.88558 :: WM creates submit requests with old sequence code upon ...
==============================================================================
bug 88558                                                             | FAIL |
GeneralError: '\nError - Operation failed\nUnable to find any endpoint where to perform service request\n'
------------------------------------------------------------------------------
Testsuites.88558 :: WM creates submit requests with old sequence c... | FAIL |
1 critical test, 0 passed, 1 failed
1 test total, 0 passed, 1 failed
==============================================================================
Testsuites.88569 :: WMS: LCMAPS should log on file only and not on syslog     
==============================================================================
bug 88569                                                             | FAIL |
GeneralError: 'Error while executing remote command => ls -l /var/log/glite/lcmaps.log'
------------------------------------------------------------------------------
Testsuites.88569 :: WMS: LCMAPS should log on file only and not on... | FAIL |
1 critical test, 0 passed, 1 failed
1 test total, 0 passed, 1 failed
==============================================================================
Testsuites.89435 :: GlueServiceStatusInfo: ??                                 
==============================================================================
bug 89435                                                             | PASS |
------------------------------------------------------------------------------
Testsuites.89435 :: GlueServiceStatusInfo: ??                         | PASS |
1 critical test, 1 passed, 0 failed
1 test total, 1 passed, 0 failed
==============================================================================
Testsuites.89506 :: EMI WMS wmproxy rpm doesn't set execution permissions a...
==============================================================================
bug 89506                                                             | FAIL |
GeneralError: "Test failed, execution permissions haven't been set correctly."
------------------------------------------------------------------------------
Testsuites.89506 :: EMI WMS wmproxy rpm doesn't set execution perm... | FAIL |
1 critical test, 0 passed, 1 failed
1 test total, 0 passed, 1 failed
==============================================================================
Testsuites.89508 :: EMI WMS WM might abort resubmitted jobs                   
==============================================================================
bug 89508                                                             | FAIL |
GeneralError: "lcg-infosites: no BDII could be contacted\nlcg-infosites: last BDII tried was 'certtbrc-bdii.cern.ch:2170'\nlcg-infosites: IO::Socket::INET: Bad hostname 'certtbrc-bdii.cern.ch:2170'"
------------------------------------------------------------------------------
Testsuites.89508 :: EMI WMS WM might abort resubmitted jobs           | FAIL |
1 critical test, 0 passed, 1 failed
1 test total, 0 passed, 1 failed
==============================================================================
Testsuites.89577 :: EMI WMS wmproxy init.d script stop/start problems         
==============================================================================
bug 89577                                                             | FAIL |
GeneralError: "Restart command for workload manager proxy don't restart httpd. pids before: 16206 , 16930 , 16931 , 16932 , 16933 , 16934 , 16935 , pids after: 16206 , 17448 , 17449 , 17450 , 17451 , 17452 , 17453"
------------------------------------------------------------------------------
Testsuites.89577 :: EMI WMS wmproxy init.d script stop/start problems | FAIL |
1 critical test, 0 passed, 1 failed
1 test total, 0 passed, 1 failed
==============================================================================
Testsuites.89674 :: glite-wms-check-daemons.sh should not restart daemons u...
==============================================================================
bug 89674                                                             | FAIL |
GeneralError: "glite-wms-check-daemons.sh script didn't restart workload manager"
------------------------------------------------------------------------------
Testsuites.89674 :: glite-wms-check-daemons.sh should not restart ... | FAIL |
1 critical test, 0 passed, 1 failed
1 test total, 0 passed, 1 failed
==============================================================================
Testsuites.89857 :: Wrong location for PID file                               
==============================================================================
bug 89857                                                             | FAIL |
GeneralError: 'Error while executing remote command => ls /tmp/*.pid'
------------------------------------------------------------------------------
Testsuites.89857 :: Wrong location for PID file                       | FAIL |
1 critical test, 0 passed, 1 failed
1 test total, 0 passed, 1 failed
==============================================================================
Testsuites.89871 :: WMS logs should keep track of the last 90 days            
==============================================================================
bug 89871                                                             | PASS |
------------------------------------------------------------------------------
Testsuites.89871 :: WMS logs should keep track of the last 90 days    | PASS |
1 critical test, 1 passed, 0 failed
1 test total, 1 passed, 0 failed
==============================================================================
Testsuites.90034 :: LB failover mechanism in WMproxy needs to be reviewed     
==============================================================================
bug 90034                                                             | FAIL |
GeneralError: '\nError - Operation failed\nUnable to find any endpoint where to perform service request\n'
------------------------------------------------------------------------------
Testsuites.90034 :: LB failover mechanism in WMproxy needs to be r... | FAIL |
1 critical test, 0 passed, 1 failed
1 test total, 0 passed, 1 failed
==============================================================================
Testsuites.90129 :: yaim-wms creates wms.proxy in wrong path                  
==============================================================================
bug 90129                                                             | PASS |
------------------------------------------------------------------------------
Testsuites.90129 :: yaim-wms creates wms.proxy in wrong path          | PASS |
1 critical test, 1 passed, 0 failed
1 test total, 1 passed, 0 failed
==============================================================================
Testsuites.90640 :: cron job deletes /var/proxycache                          
==============================================================================
bug 90640                                                             | PASS |
------------------------------------------------------------------------------
Testsuites.90640 :: cron job deletes /var/proxycache                  | PASS |
1 critical test, 1 passed, 0 failed
1 test total, 1 passed, 0 failed
==============================================================================
Testsuites.90760 :: yaim-wms changes for Argus based authZ                    
==============================================================================
bug 90760                                                             | FAIL |
GeneralError: 'To verify this bug it is necessary to set the YAIM_FILE in the configuration file'
------------------------------------------------------------------------------
Testsuites.90760 :: yaim-wms changes for Argus based authZ            | FAIL |
1 critical test, 0 passed, 1 failed
1 test total, 0 passed, 1 failed
==============================================================================
Testsuites.90830 :: ICE should use env vars in its configuration              
==============================================================================
bug 90830                                                             | FAIL |
GeneralError: 'Problem with the following attributes in the ICE section:set([\'ice_host_cert   =   "${GLITE_HOST_CERT};\', \'ice_host_cert   =   "${GLITE_HOST_CERT}";\', \'ice_host_key   =   "${GLITE_HOST_KEY}";\', \'ice_host_key   =   "${GLITE_HOST_KEY};\'])'
------------------------------------------------------------------------------
Testsuites.90830 :: ICE should use env vars in its configuration      | FAIL |
1 critical test, 0 passed, 1 failed
1 test total, 0 passed, 1 failed
==============================================================================
Testsuites.91078 :: ICE log verbosity should be reduced to 300                
==============================================================================
bug 91078                                                             | FAIL |
GeneralError: 'Test failed, ICE log verbosity is not 300 as expected but 500'
------------------------------------------------------------------------------
Testsuites.91078 :: ICE log verbosity should be reduced to 300        | FAIL |
1 critical test, 0 passed, 1 failed
1 test total, 0 passed, 1 failed
==============================================================================
Testsuites.91115 :: Make some WMS init scripts System V compatible            
==============================================================================
bug 91115                                                             | PASS |
------------------------------------------------------------------------------
Testsuites.91115 :: Make some WMS init scripts System V compatible    | PASS |
1 critical test, 1 passed, 0 failed
1 test total, 1 passed, 0 failed
==============================================================================
Testsuites.91484 :: move lcmaps.log from /var/log/glite to WMS_LOCATION_LOG   
==============================================================================
bug 91484                                                             | FAIL |
GeneralError: 'Test failed, find lcmaps.log file at directory /var/log/glite'
------------------------------------------------------------------------------
Testsuites.91484 :: move lcmaps.log from /var/log/glite to WMS_LOC... | FAIL |
1 critical test, 0 passed, 1 failed
1 test total, 0 passed, 1 failed
==============================================================================
Testsuites.91486 :: WMS: use logrotate uniformly in ice,lm,jc,wm,wmp          
==============================================================================
bug 91486                                                             | PASS |
------------------------------------------------------------------------------
Testsuites.91486 :: WMS: use logrotate uniformly in ice,lm,jc,wm,wmp  | PASS |
1 critical test, 1 passed, 0 failed
1 test total, 1 passed, 0 failed
==============================================================================
Testsuites.91488 :: remove several dismissed parameters from the WMS config...
==============================================================================
bug 91488                                                             | PASS |
------------------------------------------------------------------------------
Testsuites.91488 :: remove several dismissed parameters from the W... | PASS |
1 critical test, 1 passed, 0 failed
1 test total, 1 passed, 0 failed
==============================================================================
Testsuites.91563 :: yaim-wms: set ldap query filter expression for GLUE2 in...
==============================================================================
bug 91563                                                             | PASS |
------------------------------------------------------------------------------
Testsuites.91563 :: yaim-wms: set ldap query filter expression for... | PASS |
1 critical test, 1 passed, 0 failed
1 test total, 1 passed, 0 failed
==============================================================================
Testsuites.91834 :: Pid file of ICE and WM has glite ownership                
==============================================================================
bug 91834                                                             | PASS |
------------------------------------------------------------------------------
Testsuites.91834 :: Pid file of ICE and WM has glite ownership        | PASS |
1 critical test, 1 passed, 0 failed
1 test total, 1 passed, 0 failed
==============================================================================
Testsuites.91875 :: EMI WMS does not use grid_monitor                         
==============================================================================
bug 91875                                                             | FAIL |
GeneralError: 'Unable to find script /opt/lcg/sbin/grid_monitor.sh'
------------------------------------------------------------------------------
Testsuites.91875 :: EMI WMS does not use grid_monitor                 | FAIL |
1 critical test, 0 passed, 1 failed
1 test total, 0 passed, 1 failed
==============================================================================
Testsuites.91941 :: The job replanner should be configurable                  
==============================================================================
bug 91941                                                             | FAIL |
GeneralError: 'Job replanner is not in action as expected'
------------------------------------------------------------------------------
Testsuites.91941 :: The job replanner should be configurable          | FAIL |
1 critical test, 0 passed, 1 failed
1 test total, 0 passed, 1 failed
==============================================================================
Testsuites.92657 :: some sensible information should be logged on syslog      
==============================================================================
bug 92657                                                             | FAIL |
GeneralError: '\nError - Operation failed\nUnable to find any endpoint where to perform service request\n'
------------------------------------------------------------------------------
Testsuites.92657 :: some sensible information should be logged on ... | FAIL |
1 critical test, 0 passed, 1 failed
1 test total, 0 passed, 1 failed
==============================================================================
Testsuites.92922 :: EMI-1 WMS does not propagate user job exit code           
==============================================================================
bug 92922                                                             | FAIL |
GeneralError: '\nError - Operation failed\nUnable to find any endpoint where to perform service request\n'
------------------------------------------------------------------------------
Testsuites.92922 :: EMI-1 WMS does not propagate user job exit code   | FAIL |
1 critical test, 0 passed, 1 failed
1 test total, 0 passed, 1 failed
==============================================================================
Testsuites.94683 :: Better output message from glite-wms-job-status for mis...
==============================================================================
bug 94683                                                             | FAIL |
GeneralError: '\nError - Operation failed\nUnable to find any endpoint where to perform service request\n'
------------------------------------------------------------------------------
Testsuites.94683 :: Better output message from glite-wms-job-statu... | FAIL |
1 critical test, 0 passed, 1 failed
1 test total, 0 passed, 1 failed
==============================================================================
Testsuites.95584 :: glite-wms-ice-proxy-renew can block undefinitely          
==============================================================================
bug 95584                                                             | FAIL |
GeneralError: '\nError - Operation failed\nUnable to find any endpoint where to perform service request\n'
------------------------------------------------------------------------------
Testsuites.95584 :: glite-wms-ice-proxy-renew can block undefinitely  | FAIL |
1 critical test, 0 passed, 1 failed
1 test total, 0 passed, 1 failed
==============================================================================
Testsuites.96136 :: WMS stops accepting submissions when no swap is available 
==============================================================================
bug 96136                                                             | FAIL |
GeneralError: 'Job submission failed'
------------------------------------------------------------------------------
Testsuites.96136 :: WMS stops accepting submissions when no swap i... | FAIL |
1 critical test, 0 passed, 1 failed
1 test total, 0 passed, 1 failed
==============================================================================
Testsuites.97319 :: Set asyncjobstart=false to avoid lost jobs                
==============================================================================
bug 97319                                                             | PASS |
------------------------------------------------------------------------------
Testsuites.97319 :: Set asyncjobstart=false to avoid lost jobs        | PASS |
1 critical test, 1 passed, 0 failed
1 test total, 1 passed, 0 failed
==============================================================================
Testsuites.98279 :: Job perusal is broken in EMI-2 WMS                        
==============================================================================
bug 98279                                                             | FAIL |
GeneralError: '\nError - Operation failed\nUnable to find any endpoint where to perform service request\n'
------------------------------------------------------------------------------
Testsuites.98279 :: Job perusal is broken in EMI-2 WMS                | FAIL |
1 critical test, 0 passed, 1 failed
1 test total, 0 passed, 1 failed
==============================================================================
Testsuites.98524 :: glite-wms-job-output requires a valid delegated proxy o...
==============================================================================
bug 98524                                                             | FAIL |
GeneralError: '\nError - Operation failed\nUnable to find any endpoint where to perform service request\n'
------------------------------------------------------------------------------
Testsuites.98524 :: glite-wms-job-output requires a valid delegate... | FAIL |
1 critical test, 0 passed, 1 failed
1 test total, 0 passed, 1 failed
==============================================================================
Testsuites.98724 :: Title: ICE removes its pid file at the start() instead ...
==============================================================================
bug 98724                                                             | PASS |
------------------------------------------------------------------------------
Testsuites.98724 :: Title: ICE removes its pid file at the start()... | PASS |
1 critical test, 1 passed, 0 failed
1 test total, 1 passed, 0 failed
==============================================================================
Testsuites.99017 :: wmproxy init script 'status' does not return error when...
==============================================================================
bug 99017                                                             | FAIL |
GeneralError: 'Return value of wmproxy init script is 0 instead of 1 as expected'
------------------------------------------------------------------------------
Testsuites.99017 :: wmproxy init script 'status' does not return e... | FAIL |
1 critical test, 0 passed, 1 failed
1 test total, 0 passed, 1 failed
==============================================================================
Testsuites.Task23845 :: Semi-automated service backends configuration for WMS 
==============================================================================
task 23845                                                            | PASS |
------------------------------------------------------------------------------
Testsuites.Task23845 :: Semi-automated service backends configurat... | PASS |
1 critical test, 1 passed, 0 failed
1 test total, 1 passed, 0 failed
==============================================================================
Testsuites                                                            | FAIL |
120 critical tests, 36 passed, 84 failed
120 tests total, 36 passed, 84 failed
==============================================================================
Output:  /home/capannini/certificazione/WMSTaskIGIRTC175/regression/output.xml
Log:     /home/capannini/certificazione/WMSTaskIGIRTC175/regression/log.html
Report:  /home/capannini/certificazione/WMSTaskIGIRTC175/regression/report.html
  -- FabioCapannini - 2014-03-20
Line: 659 to 1732
 
META FILEATTACHMENT attachment="feed.tgz" attr="" comment="" date="1395841395" name="feed.tgz" path="feed.tgz" size="128342" user="FabioCapannini" version="1"
META FILEATTACHMENT attachment="cancel.tgz" attr="" comment="" date="1395848972" name="cancel.tgz" path="cancel.tgz" size="144202" user="FabioCapannini" version="1"
META FILEATTACHMENT attachment="various.tgz" attr="" comment="" date="1395850307" name="various.tgz" path="various.tgz" size="135058" user="FabioCapannini" version="1"
Added:
>
>
META FILEATTACHMENT attachment="regression.tgz" attr="" comment="" date="1395911355" name="regression.tgz" path="regression.tgz" size="572400" user="FabioCapannini" version="1"
 
This site is powered by the TWiki collaboration platformCopyright © 2008-2019 by the contributing authors. All material on this collaboration platform is the property of the contributing authors.
Ideas, requests, problems regarding TWiki? Send feedback