Difference: WMS365TestReport (5 vs. 6)

Revision 62014-06-09 - FabioCapannini

Line: 1 to 1
 
META TOPICPARENT name="TestingWms"

WMS 3.6.5 test report - IGIRTC-179

Line: 266 to 266
 Log: /home/capannini/certificazione/WMSTaskIGIRTC179/log.html Report: /home/capannini/certificazione/WMSTaskIGIRTC179/report.html
Added:
>
>

Job resubmission - PASSED

[capannini@emitestbed54 WMSTaskIGIRTC179]$ pybot ~/git/WMS-Test-Suite/robot_testsuites/wms_tests/testsuites/WMS-service/WMS-job-resubmit.html
==============================================================================
WMS-job-resubmit :: WMS Job Resubmit Test Suite                               
==============================================================================
Shallow Resubmission                                                  ....
 Shallow Resubmission - CREAM 

Shallow Resubmission                                                  | PASS |
------------------------------------------------------------------------------
Deep Resubmission                                                     ....
 Deep Resubmission - CREAM 

Deep Resubmission                                                     | PASS |
------------------------------------------------------------------------------
WMS-job-resubmit :: WMS Job Resubmit Test Suite                       | PASS |
2 critical tests, 2 passed, 0 failed
2 tests total, 2 passed, 0 failed
==============================================================================
Output:  /home/capannini/certificazione/WMSTaskIGIRTC179/output.xml
Log:     /home/capannini/certificazione/WMSTaskIGIRTC179/log.html
Report:  /home/capannini/certificazione/WMSTaskIGIRTC179/report.html

Limiter mechanism - FAILED

[capannini@emitestbed54 WMSTaskIGIRTC179]$ pybot ~/git/WMS-Test-Suite/robot_testsuites/wms_tests/testsuites/WMS-service/WMS-limiter-mechanism.html
==============================================================================
WMS-limiter-mechanism :: Test the WMS limiter mechanism operation             
==============================================================================
Test Option load1                                                     | FAIL |
Failure reason is not 'System load is too high' as expected: '
Connecting to the service https://emitestbed44.cnaf.infn.it:7443/glite_wms_wmproxy_server


Connection failed: CA certificate verification failed



Error - Operation failed
Unable to find any endpoint where to perform service request
' does not contain 'System load is too high'
------------------------------------------------------------------------------
Test Option load5                                                     | FAIL |
Failure reason is not 'System load is too high' as expected: '
Connecting to the service https://emitestbed44.cnaf.infn.it:7443/glite_wms_wmproxy_server


Connection failed: CA certificate verification failed



Error - Operation failed
Unable to find any endpoint where to perform service request
' does not contain 'System load is too high'
------------------------------------------------------------------------------
Test Option load15                                                    | FAIL |
Failure reason is not 'System load is too high' as expected: '
Connecting to the service https://emitestbed44.cnaf.infn.it:7443/glite_wms_wmproxy_server


Connection failed: CA certificate verification failed



Error - Operation failed
Unable to find any endpoint where to perform service request
' does not contain 'System load is too high'
------------------------------------------------------------------------------
Test Option memusage                                                  | FAIL |
Failure reason is not 'System load is too high' as expected: '
Connecting to the service https://emitestbed44.cnaf.infn.it:7443/glite_wms_wmproxy_server


Connection failed: CA certificate verification failed



Error - Operation failed
Unable to find any endpoint where to perform service request
' does not contain 'System load is too high'
------------------------------------------------------------------------------
Test Option swapusage                                                 | FAIL |
Failure reason is not 'System load is too high' as expected: '
Connecting to the service https://emitestbed44.cnaf.infn.it:7443/glite_wms_wmproxy_server


Connection failed: CA certificate verification failed



Error - Operation failed
Unable to find any endpoint where to perform service request
' does not contain 'System load is too high'
------------------------------------------------------------------------------
Test Option ftpconn                                                   | FAIL |
Failure reason is not 'System load is too high' as expected: '
Connecting to the service https://emitestbed44.cnaf.infn.it:7443/glite_wms_wmproxy_server


Connection failed: CA certificate verification failed



Error - Operation failed
Unable to find any endpoint where to perform service request
' does not contain 'System load is too high'
------------------------------------------------------------------------------
Test Option diskusage                                                 | FAIL |
Failure reason is not 'System load is too high' as expected: '
Connecting to the service https://emitestbed44.cnaf.infn.it:7443/glite_wms_wmproxy_server


Connection failed: CA certificate verification failed



Error - Operation failed
Unable to find any endpoint where to perform service request
' does not contain 'System load is too high'
------------------------------------------------------------------------------
Test Option fdnum                                                     | FAIL |
Failure reason is not 'System load is too high' as expected: '
Connecting to the service https://emitestbed44.cnaf.infn.it:7443/glite_wms_wmproxy_server


Connection failed: CA certificate verification failed



Error - Operation failed
Unable to find any endpoint where to perform service request
' does not contain 'System load is too high'
------------------------------------------------------------------------------
Test Option jdnum                                                     | FAIL |
Failure reason is not 'System load is too high' as expected: '
Connecting to the service https://emitestbed44.cnaf.infn.it:7443/glite_wms_wmproxy_server


Connection failed: CA certificate verification failed



Error - Operation failed
Unable to find any endpoint where to perform service request
' does not contain 'System load is too high'
------------------------------------------------------------------------------
Test Option jdsize                                                    | FAIL |
Failure reason is not 'System load is too high' as expected: '
Connecting to the service https://emitestbed44.cnaf.infn.it:7443/glite_wms_wmproxy_server


Connection failed: CA certificate verification failed



Error - Operation failed
Unable to find any endpoint where to perform service request
' does not contain 'System load is too high'
------------------------------------------------------------------------------
WMS-limiter-mechanism :: Test the WMS limiter mechanism operation     | FAIL |
10 critical tests, 0 passed, 10 failed
10 tests total, 0 passed, 10 failed
==============================================================================
Output:  /home/capannini/certificazione/WMSTaskIGIRTC179/output.xml
Log:     /home/capannini/certificazione/WMSTaskIGIRTC179/log.html
Report:  /home/capannini/certificazione/WMSTaskIGIRTC179/report.html

Listmatch - PASSED

[capannini@emitestbed54 WMSTaskIGIRTC179]$ pybot ~/git/WMS-Test-Suite/robot_testsuites/wms_tests/testsuites/WMS-service/WMS-list-match.html
==============================================================================
WMS-list-match :: WMS list match testing suite.                               
==============================================================================
Check Executables                                                     | PASS |
------------------------------------------------------------------------------
Simple Matching                                                       | PASS |
------------------------------------------------------------------------------
Delegation Matching                                                   | PASS |
------------------------------------------------------------------------------
Exclude CE from Match                                                 | PASS |
------------------------------------------------------------------------------
Failure Matching                                                      | PASS |
------------------------------------------------------------------------------
Matching (EnableWMSFeedback True)                                     | PASS |
------------------------------------------------------------------------------
WMS-list-match :: WMS list match testing suite.                       | PASS |
6 critical tests, 6 passed, 0 failed
6 tests total, 6 passed, 0 failed
==============================================================================
Output:  /home/capannini/certificazione/WMSTaskIGIRTC179/output.xml
Log:     /home/capannini/certificazione/WMSTaskIGIRTC179/log.html
Report:  /home/capannini/certificazione/WMSTaskIGIRTC179/report.html

Prologue/epilogue - PASSED

[capannini@emitestbed54 WMSTaskIGIRTC179]$ pybot ~/git/WMS-Test-Suite/robot_testsuites/wms_tests/testsuites/WMS-service/WMS-prologue-epilogue.html
==============================================================================
WMS-prologue-epilogue :: WMS Prologue Epilogue Test Suite                     
==============================================================================
Prologue                                                              ....
 Prologue - CREAM 

Prologue                                                              | PASS |
------------------------------------------------------------------------------
Epilogue                                                              ....
 Epilogue - CREAM 

Epilogue                                                              | PASS |
------------------------------------------------------------------------------
Prologue and Epilogue                                                 ....
 Prologue and Epilogue - CREAM 

Prologue and Epilogue                                                 | PASS |
------------------------------------------------------------------------------
WMS-prologue-epilogue :: WMS Prologue Epilogue Test Suite             | PASS |
3 critical tests, 3 passed, 0 failed
3 tests total, 3 passed, 0 failed
==============================================================================
Output:  /home/capannini/certificazione/WMSTaskIGIRTC179/output.xml
Log:     /home/capannini/certificazione/WMSTaskIGIRTC179/log.html
Report:  /home/capannini/certificazione/WMSTaskIGIRTC179/report.html

Proxy renewal - PASSED

[capannini@emitestbed54 WMSTaskIGIRTC179]$ myproxy-init -s myproxy.cnaf.infn.it -d -n
Your identity: /C=IT/O=INFN/OU=Personal Certificate/L=CNAF/CN=Fabio Capannini
Enter GRID pass phrase for this identity:
Creating proxy .................................................................................... Done
Proxy Verify OK
Your proxy is valid until: Mon Jun 16 16:13:11 2014
A proxy valid for 168 hours (7.0 days) for user /C=IT/O=INFN/OU=Personal Certificate/L=CNAF/CN=Fabio Capannini now exists on myproxy.cnaf.infn.it.
[root@emitestbed44 ~]# rm -rf /var/ice/persist_dir/*
[root@emitestbed44 ~]# rm -f /var/glite/spool/glite-renewd/*
[root@emitestbed44 ~]# /etc/init.d/glite-wms-ice restart
stopping ICE... ok
starting ICE... ok

[capannini@emitestbed54 WMSTaskIGIRTC179]$ pybot ~/git/WMS-Test-Suite/robot_testsuites/wms_tests/testsuites/WMS-service/WMS-proxy-renewal.html
==============================================================================
WMS-proxy-renewal :: WMS Proxy Renewal Test Suite                             
==============================================================================
Proxy renewal                                                         ....
 Proxy renewal - CREAM 

Proxy renewal                                                         | PASS |
------------------------------------------------------------------------------
Proxy renewal without setting MYPROXYSERVER                           ....
 Proxy renewal without setting MYPROXYSERVER - CREAM 

Proxy renewal without setting MYPROXYSERVER                           | PASS |
------------------------------------------------------------------------------
WMS-proxy-renewal :: WMS Proxy Renewal Test Suite                     | PASS |
2 critical tests, 2 passed, 0 failed
2 tests total, 2 passed, 0 failed
==============================================================================
Output:  /home/capannini/certificazione/WMSTaskIGIRTC179/output.xml
Log:     /home/capannini/certificazione/WMSTaskIGIRTC179/log.html
Report:  /home/capannini/certificazione/WMSTaskIGIRTC179/report.html

Purger - SOME FAILURES

[capannini@emitestbed54 WMSTaskIGIRTC179]$ pybot -e case1 -e case6 -e case7 ~/git/WMS-Test-Suite/robot_testsuites/wms_tests/testsuites/WMS-service/WMS-check-purger.html
==============================================================================
WMS-check-purger :: WMS Check Purger Test Suite                               
==============================================================================
Test purge , normal job cycle ( Submit to CREAM CE )                  | PASS |
------------------------------------------------------------------------------
Test proxy cache purging                                              | FAIL |
GeneralError: 'Test Failed. There are empty directories in %2FC%3DIT%2FO%3DINFN%2FOU%3DPersonal%20Certificate%2FL%3DCNAF%2FCN%3DFabio%20Capannini'
------------------------------------------------------------------------------
SandBoxDir cron purger ( Submit a job and force its purge before i... | PASS |
------------------------------------------------------------------------------
SandBoxDir cron purger ( Purge a DONE job )                           | PASS |
------------------------------------------------------------------------------
SandBoxDir cron purger ( Purge a DAG job )                            | PASS |
------------------------------------------------------------------------------
WMS-check-purger :: WMS Check Purger Test Suite                       | FAIL |
5 critical tests, 4 passed, 1 failed
5 tests total, 4 passed, 1 failed
==============================================================================
Output:  /home/capannini/certificazione/WMSTaskIGIRTC179/output.xml
Log:     /home/capannini/certificazione/WMSTaskIGIRTC179/log.html
Report:  /home/capannini/certificazione/WMSTaskIGIRTC179/report.html

Configuration - SOME FAILURES

[capannini@emitestbed54 WMSTaskIGIRTC179]$ pybot ~/git/WMS-Test-Suite/robot_testsuites/wms_tests/testsuites/WMS-service/WMS-check-configuration-3.4.html
==============================================================================
WMS-check-configuration-3.4 :: Check the syntax of the WMS configuration fi...
==============================================================================
Check Common Section                                                  | PASS |
------------------------------------------------------------------------------
Check JobController Section                                           | PASS |
------------------------------------------------------------------------------
Check NetworkServer Section                                           | PASS |
------------------------------------------------------------------------------
Check LogMonitor Section                                              | PASS |
------------------------------------------------------------------------------
Check WorkloadManager Section                                         | FAIL |
GeneralError: u'Section: WorkloadManager , problem with following attributes: set([\'IsmThreads  =  true;\', \'IsmIiLDAPCEFilterExt  =  "(|(GlueCEAccessControlBaseRule=VO:testers.eu-emi.eu)(GlueCEAccessControlBaseRule=VOMS:/testers.eu-emi.eu/*)(GlueCEAccessControlBaseRule=VO:testers2.eu-emi.eu)(GlueCEAccessControlBaseRule=VOMS:/testers2.eu-emi.eu/*)(GlueCEAccessControlBaseRule=VO:testers3.eu-emi.eu)(GlueCEAccessControlBaseRule=VOMS:/testers3.eu-emi.eu/*)(GlueCEAccessControlBaseRule=VO:dteam)(GlueCEAccessControlBaseRule=VOMS:/dteam/*)(GlueCEAccessControlBaseRule=VO:infngrid)(GlueCEAccessControlBaseRule=VOMS:/infngrid/*))";\', \'IsmThreads  =  false;\', \'IsmIiLDAPCEFilterExt  =  "(|(GlueCEAccessControlBaseRule=VO:testers.eu-emi.eu)(GlueCEAccessControlBaseRule=VOMS:/testers.eu-emi.eu/*)(GlueCEAccessControlBaseRule=VO:testers2.eu-emi.eu)(GlueCEAccessControlBaseRule=VOMS:/testers2.eu-emi.eu/*)(GlueCEAccessControlBaseRule=VO:cms)(GlueCEAccessControlBaseRule=VOMS:/cms/*)(GlueCEAccessControlBaseRule=VO:dteam)(GlueCEAccessControlBaseRule=VOMS:/dteam/*)(GlueCEAccessControlBaseRule=VO:infngrid)(GlueCEAccessControlBaseRule=VOMS:/infngrid/*))";\'])'
------------------------------------------------------------------------------
Check WorkloadManagerProxy Section                                    | FAIL |
GeneralError: u'Section: WorkloadManagerProxy , problem with following attributes: set([\'AsyncJobStart  =  true;\', \'AsyncJobStart  =  false;\', \'Wms_Pepc_ResourceId  =  "https://emitestbed44.cnaf.infn.it:7443/glite_wms_wmproxy_server";\'])'
------------------------------------------------------------------------------
Check ICE Section                                                     | FAIL |
GeneralError: u"Section: ICE , problem with following attributes: set(['proxy_renewal_timeout  =  120;', 'ice_log_level   =   500;', 'ice_log_level   =   300;'])"
------------------------------------------------------------------------------
Check Variables                                                       | FAIL |
This test requires the YAIM_FILE configuration file. Please set the YAIM_FILE variable in the test's configuration file.
------------------------------------------------------------------------------
WMS-check-configuration-3.4 :: Check the syntax of the WMS configu... | FAIL |
8 critical tests, 4 passed, 4 failed
8 tests total, 4 passed, 4 failed
==============================================================================
Output:  /home/capannini/certificazione/WMSTaskIGIRTC179/output.xml
Log:     /home/capannini/certificazione/WMSTaskIGIRTC179/log.html
Report:  /home/capannini/certificazione/WMSTaskIGIRTC179/report.html

Delegation SOME FAILURES

[capannini@emitestbed54 WMSTaskIGIRTC179]$ pybot ~/git/WMS-Test-Suite/robot_testsuites/wms_tests/testsuites/WMS-service/WMS-delegation.html
==============================================================================
WMS-delegation :: WMS Delegation Test Suite                                   
==============================================================================
Check --autm-delegation option                                        | PASS |
------------------------------------------------------------------------------
Check --delegationid option                                           | PASS |
------------------------------------------------------------------------------
Try to delegate with a short proxy                                    | PASS |
------------------------------------------------------------------------------
Works with expired proxy                                              | FAIL |
RunCommandError: u'Command glite-wms-job-info --config /home/capannini/certificazione/WMSTaskIGIRTC179/WMSService-WMS-delegation_20140609171025/wms.conf -d deleg-1402326641 failed. Failure message: \nConnecting to the service https://emitestbed44.cnaf.infn.it:7443/glite_wms_wmproxy_server\n\n\nError - WMProxy Server Error\nProxy exception: the proxy has expired\nError code: SOAP-ENV:Server\n\n'
------------------------------------------------------------------------------
Works with long chain proxies (ggus ticket 79096)                     | FAIL |
GeneralError: 'Failed to create a valid user proxy'
------------------------------------------------------------------------------
WMS-delegation :: WMS Delegation Test Suite                           | FAIL |
5 critical tests, 3 passed, 2 failed
5 tests total, 3 passed, 2 failed
==============================================================================
Output:  /home/capannini/certificazione/WMSTaskIGIRTC179/output.xml
Log:     /home/capannini/certificazione/WMSTaskIGIRTC179/log.html
Report:  /home/capannini/certificazione/WMSTaskIGIRTC179/report.html

Feedback - PASSED

The parameter EnableReplanner has been introduced but is not configured by yaim so it must be manually defined in glite_wms.conf (WorkloadManager section) before
running the test. If it is not set, the test fails as expected as the default is false; it must be set to true for this test to be run successfully.
 



Line: 508 to 874
 
META FILEATTACHMENT attachment="update_emitestbed44.log" attr="" comment="" date="1401377074" name="update_emitestbed44.log" path="update_emitestbed44.log" size="44726" user="FabioCapannini" version="1"
META FILEATTACHMENT attachment="cycle.tgz" attr="" comment="" date="1401804092" name="cycle.tgz" path="cycle.tgz" size="183574" user="FabioCapannini" version="1"
META FILEATTACHMENT attachment="jdl.tgz" attr="" comment="" date="1401894514" name="jdl.tgz" path="jdl.tgz" size="178930" user="FabioCapannini" version="1"
Added:
>
>
META FILEATTACHMENT attachment="resubmit.tgz" attr="" comment="" date="1402321011" name="resubmit.tgz" path="resubmit.tgz" size="128341" user="FabioCapannini" version="1"
META FILEATTACHMENT attachment="limiter.tgz" attr="" comment="" date="1402321278" name="limiter.tgz" path="limiter.tgz" size="137254" user="FabioCapannini" version="1"
META FILEATTACHMENT attachment="listmatch.tgz" attr="" comment="" date="1402321448" name="listmatch.tgz" path="listmatch.tgz" size="121166" user="FabioCapannini" version="1"
META FILEATTACHMENT attachment="proepi.tgz" attr="" comment="" date="1402323127" name="proepi.tgz" path="proepi.tgz" size="131417" user="FabioCapannini" version="1"
META FILEATTACHMENT attachment="renewal.tgz" attr="" comment="" date="1402325143" name="renewal.tgz" path="renewal.tgz" size="136315" user="FabioCapannini" version="1"
META FILEATTACHMENT attachment="purger.tgz" attr="" comment="" date="1402326158" name="purger.tgz" path="purger.tgz" size="137893" user="FabioCapannini" version="1"
META FILEATTACHMENT attachment="conf.tgz" attr="" comment="" date="1402326576" name="conf.tgz" path="conf.tgz" size="119276" user="FabioCapannini" version="1"
META FILEATTACHMENT attachment="deleg.tgz" attr="" comment="" date="1402326839" name="deleg.tgz" path="deleg.tgz" size="128123" user="FabioCapannini" version="1"
 
This site is powered by the TWiki collaboration platformCopyright © 2008-2019 by the contributing authors. All material on this collaboration platform is the property of the contributing authors.
Ideas, requests, problems regarding TWiki? Send feedback