Difference: WMSTaskIGIRTC-158SL6-UPDATE (1 vs. 9)

Revision 82013-07-31 - FabioCapannini

Line: 1 to 1
 
META TOPICPARENT name="WMSTaskIGIRTC-158"

WMS v. 3.6.0 (SL6) test report - CNAF UPDATE

Line: 731 to 731
 
Changed:
<
<

Proxy renewal -

>
>

Proxy renewal - PASSED

It is necessary to clean the proxies from ice and proxyreneal:

[root@emitestbed44 ~]# /etc/init.d/glite-wms-ice stop
stopping ICE... ok
[root@emitestbed44 ~]# rm -rf /var/ice/persist_dir/*
[root@emitestbed44 ~]# /etc/init.d/glite-wms-ice start
starting ICE... ok
[root@emitestbed44 ~]# rm -f /var/glite/spool/glite-renewd/*

then

Setting MYPROXYSERVER=myproxy.cnaf.infn.it in wms-command.conf

[capannini@emitestbed54 ~]$ voms-proxy-init --voms testers.eu-emi.eu
Enter GRID pass phrase for this identity:
Your identity: /C=IT/O=INFN/OU=Personal Certificate/L=CNAF/CN=Fabio Capannini
Creating temporary proxy ................................................................... Done
Contacting  emitestbed01.cnaf.infn.it:15002 [/C=IT/O=INFN/OU=Host/L=CNAF/CN=emitestbed01.cnaf.infn.it] "testers.eu-emi.eu" Done
Creating proxy ........................................................................ Done

Your proxy is valid until Tue Feb 19 23:07:16 2013

[capannini@emitestbed54 WMS-service]$ myproxy-init -s myproxy.cnaf.infn.it -d -n
Your identity: /C=IT/O=INFN/OU=Personal Certificate/L=CNAF/CN=Fabio Capannini
Enter GRID pass phrase for this identity:
Creating proxy .......................................... Done
Proxy Verify OK
Your proxy is valid until: Wed Aug  7 14:07:29 2013
A proxy valid for 168 hours (7.0 days) for user /C=IT/O=INFN/OU=Personal Certificate/L=CNAF/CN=Fabio Capannini now exists on myproxy.cnaf.infn.it.

[capannini@emitestbed54 WMS-service]$ python WMS-proxy-renewal.py -c wms-command.conf -V testers.eu-emi.eu -d 3 -l  -i
===> +++++++++++++++++++++++++++++++++++++++++++++++++++++
===> + TestSuite of the WMS Service                       
===> + Description: WMS test proxy renewal operation 
===> +++++++++++++++++++++++++++++++++++++++++++++++++++++

Enter the user proxy password:

 Test 1: Test proxy renewal - CE_CREAM 


 Test 2: Test proxy renewal without setting MYPROXYSERVER - CE_CREAM 

===> 
===> Test: WMS-proxy-renewal.py
===> WMS: emitestbed44.cnaf.infn.it
===> Started: 14:09:09
===> Ended  : 14:39:58
===> 
===>     === test PASSED === 
===> 
===> Test log file is WMSService-TS_20130731140909.log
 

Feedback -

Published information -

bdb database information
Line: 780 to 837
 
META FILEATTACHMENT attachment="WMSService-TS_20130731114836.log" attr="" comment="" date="1375264642" name="WMSService-TS_20130731114836.log" path="WMSService-TS_20130731114836.log" size="28808" user="FabioCapannini" version="1"
META FILEATTACHMENT attachment="WMSService-TS_20130731115818.log" attr="" comment="" date="1375265549" name="WMSService-TS_20130731115818.log" path="WMSService-TS_20130731115818.log" size="20094" user="FabioCapannini" version="1"
META FILEATTACHMENT attachment="WMSService-TS_20130731121345.log" attr="" comment="" date="1375265847" name="WMSService-TS_20130731121345.log" path="WMSService-TS_20130731121345.log" size="3355" user="FabioCapannini" version="1"
Added:
>
>
META FILEATTACHMENT attachment="WMSService-TS_20130731140909.log" attr="" comment="" date="1375274850" name="WMSService-TS_20130731140909.log" path="WMSService-TS_20130731140909.log" size="51781" user="FabioCapannini" version="1"

Revision 72013-07-31 - FabioCapannini

Line: 1 to 1
 
META TOPICPARENT name="WMSTaskIGIRTC-158"

WMS v. 3.6.0 (SL6) test report - CNAF UPDATE

Line: 534 to 534
 
Changed:
<
<

Shallow and deep resubmission -

Cancel -

Limiter mechanism - MOSTLY PASSED (SAME FAILURES AS IN EMI1)

Job purge -

Configuration file -

>
>

Shallow and deep resubmission - PASSED

[capannini@emitestbed54 WMS-service]$ python WMS-job-resubmit.py -c wms-command.conf -V testers.eu-emi.eu -d 3 -l -i
===> +++++++++++++++++++++++++++++++++++++++++++++++++++++
===> + TestSuite of the WMS Service                       
===> + Description: WMS Job Resubmission Testing 
===> +++++++++++++++++++++++++++++++++++++++++++++++++++++

Enter the user proxy password:

 Test 1: Try a shallow resubmission - CE_CREAM 


 Test 2: Try a deep resubmission - CE_CREAM 

===> 
===> Test: WMS-job-resubmit.py
===> WMS: emitestbed44.cnaf.infn.it
===> Started: 10:51:54
===> Ended  : 11:05:03
===> 
===>     === test PASSED === 
===> 
===> Test log file is WMSService-TS_20130731105154.log

Cancel - FAILED

[capannini@emitestbed54 WMS-service]$ python WMS-job-cancel.py -c wms-command.conf -V testers.eu-emi.eu -d 3 -l  -i
===> +++++++++++++++++++++++++++++++++++++++++++++++++++++
===> + TestSuite of the WMS Service                       
===> + Description: WMS Job Cancel Testing 
===> +++++++++++++++++++++++++++++++++++++++++++++++++++++

Enter the user proxy password:

 Test 1: Try to cancel a normal job 


 Test 2: Try to cancel a DAG job 


 Test 3: Try to cancel one node of a DAG job 


 Test 4: Try to cancel a collection job 


 Test 5: Try to cancel one node of a collection job 


 Test 6: Try to cancel a parametric job 


 Test 7: Try to cancel one node of a parametric job 

===> ERROR: TEST FAILS. Job's https://emitestbed44.cnaf.infn.it:9000/A2-LMhE_9duFRI2Pct2kWA status is wrong: Running

 Test 8: Try to cancel a MPI job 

===> 
===> Test: WMS-job-cancel.py
===> WMS: emitestbed44.cnaf.infn.it
===> Started: 11:08:03
===> Ended  : 11:29:54
===> 
===>     >>> TEST FAILED <<<
===> 
===>  >>> failure reason: 1 test(s) fail(s): ['Test 7: Try to cancel one node of a parametric job'] <<< 
===> 
===> Test log file is WMSService-TS_20130731110803.log
===> Error messages have been written in /home/capannini/WMS-Test-Suite-new-emitestbed44/WMS-service/WMSService-Test_20130731110803/errors.log
===> 
===>  Test directory /home/capannini/WMS-Test-Suite-new-emitestbed44/WMS-service/WMSService-Test_20130731110803 has not been cleaned for debug purpose

Limiter mechanism - FAILED

[capannini@emitestbed54 WMS-service]$ python WMS-limiter-mechanism.py -c wms-command.conf -V testers.eu-emi.eu -d 3 -l -t 1,2,3,4,6,7,8
===> +++++++++++++++++++++++++++++++++++++++++++++++++++++
===> + TestSuite of the WMS Service                       
===> + Description: WMS Limiter Mechanism 
===> +++++++++++++++++++++++++++++++++++++++++++++++++++++

 Test 1: Test option --load1 threshold for load average (1 min) 

===> ERROR: Faulure reason is not 'System load is too high' as expected.

 Test 2: Test option --load5 threshold for load average (5 min) 

===> ERROR: Faulure reason is not 'System load is too high' as expected.

 Test 3: Test option --load15 threshold for load average (15 min) 

===> ERROR: Faulure reason is not 'System load is too high' as expected.

 Test 4: Test option --memusage threshold for memory usage (%) 

===> ERROR: Faulure reason is not 'System load is too high' as expected.

 Test 6: Test option --ftpconn threshold for number of FTP connections 

===> ERROR: Faulure reason is not 'System load is too high' as expected.

 Test 7: Test option --diskusage threshold for disk usage (%) 

===> ERROR: Faulure reason is not 'System load is too high' as expected.

 Test 8: Test option --fdnum threshold for used file descriptor 

===> ERROR: Faulure reason is not 'System load is too high' as expected.
===> 
===> Test: WMS-limiter-mechanism.py
===> WMS: emitestbed44.cnaf.infn.it
===> Started: 11:48:36
===> Ended  : 11:49:19
===> 
===>     >>> TEST FAILED <<<
===> 
===>  >>> failure reason: 7 test(s) fail(s): ['Test 1: Test option --load1 threshold for load average (1 min)', 'Test 2: Test option --load5 threshold for load average (5 min)', 'Test 3: Test option --load15 threshold for load average (15 min)', 'Test 4: Test option --memusage threshold for memory usage (%)', 'Test 6: Test option --ftpconn threshold for number of FTP connections', 'Test 7: Test option --diskusage threshold for disk usage (%)', 'Test 8: Test option --fdnum threshold for used file descriptor'] <<< 
===> 
===> Test log file is WMSService-TS_20130731114836.log
===> Error messages have been written in /home/capannini/WMS-Test-Suite-new-emitestbed44/WMS-service/WMSService-Test_20130731114836/errors.log
===> 
===>  Test directory /home/capannini/WMS-Test-Suite-new-emitestbed44/WMS-service/WMSService-Test_20130731114836 has not been cleaned for debug purpose

Job purge - PASSED

[capannini@emitestbed54 WMS-service]$ python WMS-check-purger.py -c wms-command.conf -V testers.eu-emi.eu -d 3 -l -t 3
===> +++++++++++++++++++++++++++++++++++++++++++++++++++++
===> + TestSuite of the WMS Service                       
===> + Description: WMS Purge Mechanism 
===> +++++++++++++++++++++++++++++++++++++++++++++++++++++

 Test 3: Test proxy cache purging 

===> 
===> Test: WMS-check-purger.py
===> WMS: emitestbed44.cnaf.infn.it
===> Started: 11:58:18
===> Ended  : 11:58:22
===> 
===>     === test PASSED === 
===> 
===> Test log file is WMSService-TS_20130731115818.log

Configuration file - FAILED

[capannini@emitestbed54 WMS-service]$ python WMS-check-configuration-3.4.py -c wms-command.conf -d 3 -l -t 1-7
===> +++++++++++++++++++++++++++++++++++++++++++++++++++++
===> + TestSuite of the WMS Service                       
===> + Description: Check glite_wms.conf file 
===> +++++++++++++++++++++++++++++++++++++++++++++++++++++

 Test 1: Check common section 


 Test 2: Check JobController section 


 Test 3: Check NetworkServer section 


 Test 4: Check LogMonitor section 


 Test 5: Check WorkloadManager section 


 Test 6: Check WorkloadManagerProxy section 


 Test 7: Check ICE section 

===> 
===> Test: WMS-check-configuration-3.4.py
===> WMS: emitestbed44.cnaf.infn.it
===> Started: 12:13:45
===> Ended  : 12:13:45
===> 
===>     >>> TEST FAILED <<<
===> 
===>  >>> failure reason: 3 test(s) fail(s): ['Test 5: Check WorkloadManager section', 'Test 6: Check WorkloadManagerProxy section', 'Test 7: Check ICE section'] <<< 
===> 
===> Test log file is WMSService-TS_20130731121345.log
===> Error messages have been written in /home/capannini/WMS-Test-Suite-new-emitestbed44/WMS-service/WMSService-Test_20130731121345/errors.log
===> 
===>  Test directory /home/capannini/WMS-Test-Suite-new-emitestbed44/WMS-service/WMSService-Test_20130731121345 has not been cleaned for debug purpose
 

Proxy renewal -

Feedback -

Published information -

Line: 578 to 775
 
META FILEATTACHMENT attachment="WMSService-TS_20130730154422.log" attr="" comment="" date="1375192289" name="WMSService-TS_20130730154422.log" path="WMSService-TS_20130730154422.log" size="6298" user="FabioCapannini" version="1"
META FILEATTACHMENT attachment="WMSService-TS_20130730154434.log" attr="" comment="" date="1375192360" name="WMSService-TS_20130730154434.log" path="WMSService-TS_20130730154434.log" size="6532" user="FabioCapannini" version="1"
META FILEATTACHMENT attachment="WMSService-TS_20130730155534.log" attr="" comment="" date="1375193631" name="WMSService-TS_20130730155534.log" path="WMSService-TS_20130730155534.log" size="13910" user="FabioCapannini" version="1"
Added:
>
>
META FILEATTACHMENT attachment="WMSService-TS_20130731105154.log" attr="" comment="" date="1375261632" name="WMSService-TS_20130731105154.log" path="WMSService-TS_20130731105154.log" size="23275" user="FabioCapannini" version="1"
META FILEATTACHMENT attachment="WMSService-TS_20130731110803.log" attr="" comment="" date="1375263179" name="WMSService-TS_20130731110803.log" path="WMSService-TS_20130731110803.log" size="64947" user="FabioCapannini" version="1"
META FILEATTACHMENT attachment="WMSService-TS_20130731114836.log" attr="" comment="" date="1375264642" name="WMSService-TS_20130731114836.log" path="WMSService-TS_20130731114836.log" size="28808" user="FabioCapannini" version="1"
META FILEATTACHMENT attachment="WMSService-TS_20130731115818.log" attr="" comment="" date="1375265549" name="WMSService-TS_20130731115818.log" path="WMSService-TS_20130731115818.log" size="20094" user="FabioCapannini" version="1"
META FILEATTACHMENT attachment="WMSService-TS_20130731121345.log" attr="" comment="" date="1375265847" name="WMSService-TS_20130731121345.log" path="WMSService-TS_20130731121345.log" size="3355" user="FabioCapannini" version="1"

Revision 62013-07-30 - FabioCapannini

Line: 1 to 1
 
META TOPICPARENT name="WMSTaskIGIRTC-158"

WMS v. 3.6.0 (SL6) test report - CNAF UPDATE

Line: 285 to 285
 
Changed:
<
<

Parallel job -

Forwarding parameters for parallel jobs -

Perusal -

Delegation -

List-match -

Prologue and epilogue jobs -

>
>

Parallel job - PASSED

### Submit parallel job 2 CPUs
### Job to be submitted:
Executable = "/usr/bin/mpi-start";
CPUNumber  = 2;
Arguments  = "-t dummy -- counter.sh cpus 2";
InputSandbox = {"counter.sh"};
OutputSandbox = {"std.out", "std.err"};
StdOutput = "std.out";
StdError = "std.err";
Requirements = member("MPI-START", other.GlueHostApplicationSoftwareRunTimeEnvironment)
               && other.GlueCEInfoJobManager == "pbs";

[capannini@emitestbed54 ~]$ glite-wms-job-submit -a -c wms_emitestbed44.conf mpijob.jdl 

Connecting to the service https://emitestbed44.cnaf.infn.it:7443/glite_wms_wmproxy_server


====================== glite-wms-job-submit Success ======================

The job has been successfully submitted to the WMProxy
Your job identifier is:

https://emitestbed44.cnaf.infn.it:9000/DZ7YiPZ2MJp6mO6tAvnKtw

==========================================================================


[capannini@emitestbed54 ~]$ glite-wms-job-status https://emitestbed44.cnaf.infn.it:9000/DZ7YiPZ2MJp6mO6tAvnKtw


======================= glite-wms-job-status Success =====================
BOOKKEEPING INFORMATION:

Status info for the Job : https://emitestbed44.cnaf.infn.it:9000/DZ7YiPZ2MJp6mO6tAvnKtw
Current Status:     Done(Success)
Logged Reason(s):
    - job completed
    - Job Terminated Successfully
Exit code:          0
Status Reason:      Job Terminated Successfully
Destination:        emi-demo13.cnaf.infn.it:8443/cream-pbs-demo
Submitted:          Tue Jul 30 14:36:45 2013 CEST
==========================================================================

Forwarding parameters for parallel jobs - PASSED
[capannini@emitestbed54 WMS-service]$ python WMS-job-cycle.py -c wms-command.conf -V testers.eu-emi.eu -d 3 -l -t 8 -i
===> +++++++++++++++++++++++++++++++++++++++++++++++++++++
===> + TestSuite of the WMS Service                       
===> + Description: Test a complete job cycle: from submission to get output 
===> +++++++++++++++++++++++++++++++++++++++++++++++++++++

Enter the user proxy password:

 Set 8: Testing forwarding parameters for parallel jobs  Case 1 - CE_CREAM 


 Set 8: Testing forwarding parameters for parallel jobs Case 2 - CE_CREAM 


 Set 8: Testing forwarding parameters for parallel jobs Case 3  - CE_CREAM 


 Set 8: Testing forwarding parameters for parallel jobs Case 4 - CE_CREAM 


 Set 8: Testing forwarding parameters for parallel jobs Case 5 - CE_CREAM 

===> 
===> Test: WMS-job-cycle.py
===> WMS: emitestbed44.cnaf.infn.it
===> Started: 14:43:53
===> Ended  : 14:46:16
===> 
===>     === test PASSED === 
===> 
===> Test log file is WMSService-TS_20130730144353.log

Perusal - FAILED

[capannini@emitestbed54 WMS-service]$ python WMS-job-cycle.py -c wms-command.conf -V testers.eu-emi.eu -d 3 -l -t 6 -i
===> +++++++++++++++++++++++++++++++++++++++++++++++++++++
===> + TestSuite of the WMS Service                       
===> + Description: Test a complete job cycle: from submission to get output 
===> +++++++++++++++++++++++++++++++++++++++++++++++++++++

Enter the user proxy password:

 Set 6: Submit a perusal job - CE_CREAM 

===> ERROR: TEST FAILS. No chunks have been retrieved
===> ERROR: No chunks have been retrieved.
===> 
===> Test: WMS-job-cycle.py
===> WMS: emitestbed44.cnaf.infn.it
===> Started: 14:51:19
===> Ended  : 15:25:43
===> 
===>     >>> TEST FAILED <<<
===> 
===>  >>> failure reason: 1 test(s) fail(s): ['Set 6: Submit a perusal job'] <<< 
===> 
===> Test log file is WMSService-TS_20130730145119.log
===> Error messages have been written in /home/capannini/WMS-Test-Suite-new-emitestbed44/WMS-service/WMSService-Test_20130730145119/errors.log
===> 
===>  Test directory /home/capannini/WMS-Test-Suite-new-emitestbed44/WMS-service/WMSService-Test_20130730145119 has not been cleaned for debug purpose

Delegation - PASSED

Test 4 fails because the failure message has changed. Now it is 'Proxy exception: the proxy has expired'.
[capannini@emitestbed54 WMS-service]$ python WMS-delegation-test.py -c wms-command.conf -V testers.eu-emi.eu -d 3 -l -i
===> +++++++++++++++++++++++++++++++++++++++++++++++++++++
===> + TestSuite of the WMS Service                       
===> + Description: Test delegation operation 
===> +++++++++++++++++++++++++++++++++++++++++++++++++++++

Enter the user proxy password:

 Test 1: Check --autm-delegation option 


 Test 2: Check --delegationid option 


 Test 3: Try to delegate with a short proxy and check the validity 


 Test 4: Works with expired proxy 

===> ERROR: TEST FAILS. Job has been submitted with the expired delegation

 To run this test you have to set the ROLE attribute for user proxy role at configuration file 

===> 
===> Test: WMS-delegation-test.py
===> WMS: emitestbed44.cnaf.infn.it
===> Started: 15:30:38
===> Ended  : 15:31:49
===> 
===>     >>> TEST FAILED <<<
===> 
===>  >>> failure reason: 1 test(s) fail(s): ['Test 4: Works with expired proxy'] <<< 
===> 
===> Test log file is WMSService-TS_20130730153038.log
===> Error messages have been written in /home/capannini/WMS-Test-Suite-new-emitestbed44/WMS-service/WMSService-Test_20130730153038/errors.log
===> 
===>  Test directory /home/capannini/WMS-Test-Suite-new-emitestbed44/WMS-service/WMSService-Test_20130730153038 has not been cleaned for debug purpose

List-match - PASSED

Test 7 fails because there are no suitable CEs.
[capannini@emitestbed54 WMS-service]$ python WMS-listmatch-test.py -c wms-command.conf -V testers.eu-emi.eu -d 3 -l -i
===> +++++++++++++++++++++++++++++++++++++++++++++++++++++
===> + TestSuite of the WMS Service                       
===> + Description: WMS Job ListMatch Testing 
===> +++++++++++++++++++++++++++++++++++++++++++++++++++++

Enter the user proxy password:

 Test 1: check if glite-wms-job-list-match command exists 


 Test 2: test a simple matching 


 Test 3: check --delegationid option 


 Test 4: exclude a CE from the match 


 Test 5: try a failure matching (Requirements == false) 


 Test 6: try a matching with EnableWMSFeedback attribute true 


 Test 7: try a matching with data requirements 

===> ERROR: Command lcg-infosites -v 1 --vo testers.eu-emi.eu lfc failed. Failure message: lcg-infosites: no BDII could be contacted
lcg-infosites: last BDII tried was 'certtbrc-bdii.cern.ch:2170'
lcg-infosites: IO::Socket::INET: connect: timeout

 Test 8: try a gang-matching 

===> 
===> Test: WMS-listmatch-test.py
===> WMS: emitestbed44.cnaf.infn.it
===> Started: 15:44:34
===> Ended  : 15:46:47
===> 
===>     >>> TEST FAILED <<<
===> 
===>  >>> failure reason: 1 test(s) fail(s): ['Test 7: try a matching with data requirements'] <<< 
===> 
===> Test log file is WMSService-TS_20130730154434.log
===> Error messages have been written in /home/capannini/WMS-Test-Suite-new-emitestbed44/WMS-service/WMSService-Test_20130730154434/errors.log
===> 
===>  Test directory /home/capannini/WMS-Test-Suite-new-emitestbed44/WMS-service/WMSService-Test_20130730154434 has not been cleaned for debug purpose

Prologue and epilogue jobs - FAILED

[capannini@emitestbed54 WMS-service]$ python WMS-prologue-epilogue.py -c wms-command.conf -V testers.eu-emi.eu -d 3 -l  -i
===> +++++++++++++++++++++++++++++++++++++++++++++++++++++
===> + TestSuite of the WMS Service                       
===> + Description: WMS test prologue and epilogue attributes 
===> +++++++++++++++++++++++++++++++++++++++++++++++++++++

Enter the user proxy password:

 Test 1: Test prologue attribute - CE_CREAM 

===> ERROR: TEST FAILS. Job finishes with status: Done(Success) cannot retrieve output

 Test 2: Test epilogue attribute - CE_CREAM 

===> ERROR: TEST FAILS. Job finishes with status: Done(Success) cannot retrieve output

 Test 3: Test prologue and epilogue attributes - CE_CREAM 

===> ERROR: TEST FAILS. Job finishes with status: Done(Success) cannot retrieve output
===> 
===> Test: WMS-prologue-epilogue.py
===> WMS: emitestbed44.cnaf.infn.it
===> Started: 15:55:34
===> Ended  : 16:01:21
===> 
===>     >>> TEST FAILED <<<
===> 
===>  >>> failure reason: 3 test(s) fail(s): ['Test 1: Test prologue attribute', 'Test 2: Test epilogue attribute', 'Test 3: Test prologue and epilogue attributes'] <<< 
===> 
===> Test log file is WMSService-TS_20130730155534.log
===> Error messages have been written in /home/capannini/WMS-Test-Suite-new-emitestbed44/WMS-service/WMSService-Test_20130730155534/errors.log
===> 
===>  Test directory /home/capannini/WMS-Test-Suite-new-emitestbed44/WMS-service/WMSService-Test_20130730155534 has not been cleaned for debug purpose
 

Shallow and deep resubmission -

Cancel -

Limiter mechanism - MOSTLY PASSED (SAME FAILURES AS IN EMI1)

Line: 323 to 572
 
META FILEATTACHMENT attachment="WMSService-TS_20130730105749.log" attr="" comment="" date="1375174953" name="WMSService-TS_20130730105749.log" path="WMSService-TS_20130730105749.log" size="5186" user="FabioCapannini" version="1"
META FILEATTACHMENT attachment="WMSService-TS_20130730111207.log" attr="" comment="" date="1375175769" name="WMSService-TS_20130730111207.log" path="WMSService-TS_20130730111207.log" size="5096" user="FabioCapannini" version="1"
META FILEATTACHMENT attachment="WMSService-TS_20130730113927.log" attr="" comment="" date="1375178133" name="WMSService-TS_20130730113927.log" path="WMSService-TS_20130730113927.log" size="16801" user="FabioCapannini" version="1"
Added:
>
>
META FILEATTACHMENT attachment="WMSService-TS_20130730144353.log" attr="" comment="" date="1375188480" name="WMSService-TS_20130730144353.log" path="WMSService-TS_20130730144353.log" size="15889" user="FabioCapannini" version="1"
META FILEATTACHMENT attachment="WMSService-TS_20130730145119.log" attr="" comment="" date="1375190987" name="WMSService-TS_20130730145119.log" path="WMSService-TS_20130730145119.log" size="3966" user="FabioCapannini" version="1"
META FILEATTACHMENT attachment="WMSService-TS_20130730153038.log" attr="" comment="" date="1375191816" name="WMSService-TS_20130730153038.log" path="WMSService-TS_20130730153038.log" size="7346" user="FabioCapannini" version="1"
META FILEATTACHMENT attachment="WMSService-TS_20130730154422.log" attr="" comment="" date="1375192289" name="WMSService-TS_20130730154422.log" path="WMSService-TS_20130730154422.log" size="6298" user="FabioCapannini" version="1"
META FILEATTACHMENT attachment="WMSService-TS_20130730154434.log" attr="" comment="" date="1375192360" name="WMSService-TS_20130730154434.log" path="WMSService-TS_20130730154434.log" size="6532" user="FabioCapannini" version="1"
META FILEATTACHMENT attachment="WMSService-TS_20130730155534.log" attr="" comment="" date="1375193631" name="WMSService-TS_20130730155534.log" path="WMSService-TS_20130730155534.log" size="13910" user="FabioCapannini" version="1"

Revision 52013-07-30 - FabioCapannini

Line: 1 to 1
 
META TOPICPARENT name="WMSTaskIGIRTC-158"

WMS v. 3.6.0 (SL6) test report - CNAF UPDATE

Line: 153 to 153
 

Collection

Changed:
<
<
Bulk submission -
All in a jdl -

Parametric job -

Dag -

>
>
Bulk submission - FAILED
[capannini@emitestbed54 WMS-service]$ python WMS-job-cycle.py -c wms-command.conf -V testers.eu-emi.eu -d 3 -l -t 2 -i
===> +++++++++++++++++++++++++++++++++++++++++++++++++++++
===> + TestSuite of the WMS Service                       
===> + Description: Test a complete job cycle: from submission to get output 
===> +++++++++++++++++++++++++++++++++++++++++++++++++++++

Enter the user proxy password:

 Set 2: Submit a bulk of jobs - CE_CREAM 

===> ERROR: Command glite-wms-job-output --noint --dir /home/capannini/WMS-Test-Suite-new-emitestbed44/WMS-service/WMSService-Test_20130730105110/jobOutput https://emitestbed44.cnaf.infn.it:9000/Pl_ScNzAn5xX0-oU4FSxSA >> /home/capannini/WMS-Test-Suite-new-emitestbed44/WMS-service/WMSService-Test_20130730105110/file.tmp failed. Failure message: 
Error - Error parsing Job's JDL! Aobrting...


===> 
===> Test: WMS-job-cycle.py
===> WMS: emitestbed44.cnaf.infn.it
===> Started: 10:51:10
===> Ended  : 10:53:23
===> 
===>     >>> TEST FAILED <<<
===> 
===>  >>> failure reason: 1 test(s) fail(s): ['Set 2: Submit a bulk of jobs'] <<< 
===> 
===> Test log file is WMSService-TS_20130730105110.log
===> Error messages have been written in /home/capannini/WMS-Test-Suite-new-emitestbed44/WMS-service/WMSService-Test_20130730105110/errors.log
===> 
===>  Test directory /home/capannini/WMS-Test-Suite-new-emitestbed44/WMS-service/WMSService-Test_20130730105110 has not been cleaned for debug purpose

All in a jdl - FAILED
[capannini@emitestbed54 WMS-service]$ python WMS-job-cycle.py -c wms-command.conf -V testers.eu-emi.eu -d 3 -l -t 7 -i
===> +++++++++++++++++++++++++++++++++++++++++++++++++++++
===> + TestSuite of the WMS Service                       
===> + Description: Test a complete job cycle: from submission to get output 
===> +++++++++++++++++++++++++++++++++++++++++++++++++++++

Enter the user proxy password:

 Set 7: Submit a bulk of jobs using a single jdl with al the jdls of nodes - CE_CREAM 

===> ERROR: Command glite-wms-job-output --noint --dir /home/capannini/WMS-Test-Suite-new-emitestbed44/WMS-service/WMSService-Test_20130730105749/jobOutput https://emitestbed44.cnaf.infn.it:9000/MURiQHZR2Qo8UBvQlngUUA >> /home/capannini/WMS-Test-Suite-new-emitestbed44/WMS-service/WMSService-Test_20130730105749/file.tmp failed. Failure message: 
Error - Error parsing Job's JDL! Aobrting...


===> 
===> Test: WMS-job-cycle.py
===> WMS: emitestbed44.cnaf.infn.it
===> Started: 10:57:49
===> Ended  : 11:00:02
===> 
===>     >>> TEST FAILED <<<
===> 
===>  >>> failure reason: 1 test(s) fail(s): ['Set 7: Submit a bulk of jobs using a single jdl with al the jdls of nodes'] <<< 
===> 
===> Test log file is WMSService-TS_20130730105749.log
===> Error messages have been written in /home/capannini/WMS-Test-Suite-new-emitestbed44/WMS-service/WMSService-Test_20130730105749/errors.log
===> 
===>  Test directory /home/capannini/WMS-Test-Suite-new-emitestbed44/WMS-service/WMSService-Test_20130730105749 has not been cleaned for debug purpose

Parametric job - FAILED

[capannini@emitestbed54 WMS-service]$ python WMS-job-cycle.py -c wms-command.conf -V testers.eu-emi.eu -d 3 -l -t 3 -i
===> +++++++++++++++++++++++++++++++++++++++++++++++++++++
===> + TestSuite of the WMS Service                       
===> + Description: Test a complete job cycle: from submission to get output 
===> +++++++++++++++++++++++++++++++++++++++++++++++++++++

Enter the user proxy password:

 Set 3: Submit a parametric job - CE_CREAM 

===> ERROR: Command glite-wms-job-output --noint --dir /home/capannini/WMS-Test-Suite-new-emitestbed44/WMS-service/WMSService-Test_20130730111207/jobOutput https://emitestbed44.cnaf.infn.it:9000/9qgZhNbxIhW7xtR60pg7Vg >> /home/capannini/WMS-Test-Suite-new-emitestbed44/WMS-service/WMSService-Test_20130730111207/file.tmp failed. Failure message: 
Error - Error parsing Job's JDL! Aobrting...


===> 
===> Test: WMS-job-cycle.py
===> WMS: emitestbed44.cnaf.infn.it
===> Started: 11:12:07
===> Ended  : 11:14:20
===> 
===>     >>> TEST FAILED <<<
===> 
===>  >>> failure reason: 1 test(s) fail(s): ['Set 3: Submit a parametric job'] <<< 
===> 
===> Test log file is WMSService-TS_20130730111207.log
===> Error messages have been written in /home/capannini/WMS-Test-Suite-new-emitestbed44/WMS-service/WMSService-Test_20130730111207/errors.log
===> 
===>  Test directory /home/capannini/WMS-Test-Suite-new-emitestbed44/WMS-service/WMSService-Test_20130730111207 has not been cleaned for debug purpose

Dag - FAILED

[capannini@emitestbed54 WMS-service]$ python WMS-job-cycle.py -c wms-command.conf -V testers.eu-emi.eu -d 3 -l -t 4 -i
===> +++++++++++++++++++++++++++++++++++++++++++++++++++++
===> + TestSuite of the WMS Service                       
===> + Description: Test a complete job cycle: from submission to get output 
===> +++++++++++++++++++++++++++++++++++++++++++++++++++++

Enter the user proxy password:

 Set 4: Submit a DAG job 

===> ERROR: Command glite-wms-job-output --noint --dir /home/capannini/WMS-Test-Suite-new-emitestbed44/WMS-service/WMSService-Test_20130730113927/jobOutput https://emitestbed44.cnaf.infn.it:9000/myJWmxhdww7Jfn7PtaTJyg >> /home/capannini/WMS-Test-Suite-new-emitestbed44/WMS-service/WMSService-Test_20130730113927/file.tmp failed. Failure message: 
Error - Error parsing Job's JDL! Aobrting...


===> 
===> Test: WMS-job-cycle.py
===> WMS: emitestbed44.cnaf.infn.it
===> Started: 11:39:27
===> Ended  : 11:49:36
===> 
===>     >>> TEST FAILED <<<
===> 
===>  >>> failure reason: 1 test(s) fail(s): ['Set 4: Submit a DAG job'] <<< 
===> 
===> Test log file is WMSService-TS_20130730113927.log
===> Error messages have been written in /home/capannini/WMS-Test-Suite-new-emitestbed44/WMS-service/WMSService-Test_20130730113927/errors.log
===> 
===>  Test directory /home/capannini/WMS-Test-Suite-new-emitestbed44/WMS-service/WMSService-Test_20130730113927 has not been cleaned for debug purpose
 

Parallel job -

Forwarding parameters for parallel jobs -

Perusal -

Line: 187 to 319
 
META FILEATTACHMENT attachment="WMSService-TS_20130729145710.log" attr="" comment="" date="1375102864" name="WMSService-TS_20130729145710.log" path="WMSService-TS_20130729145710.log" size="6103" user="FabioCapannini" version="1"
META FILEATTACHMENT attachment="WMSService-TS_20130729153805.log" attr="" comment="" date="1375107161" name="WMSService-TS_20130729153805.log" path="WMSService-TS_20130729153805.log" size="34023" user="FabioCapannini" version="1"
META FILEATTACHMENT attachment="WMSService-TS_20130729160519.log" attr="" comment="" date="1375107172" name="WMSService-TS_20130729160519.log" path="WMSService-TS_20130729160519.log" size="8058" user="FabioCapannini" version="1"
Added:
>
>
META FILEATTACHMENT attachment="WMSService-TS_20130730105110.log" attr="" comment="" date="1375174594" name="WMSService-TS_20130730105110.log" path="WMSService-TS_20130730105110.log" size="5229" user="FabioCapannini" version="1"
META FILEATTACHMENT attachment="WMSService-TS_20130730105749.log" attr="" comment="" date="1375174953" name="WMSService-TS_20130730105749.log" path="WMSService-TS_20130730105749.log" size="5186" user="FabioCapannini" version="1"
META FILEATTACHMENT attachment="WMSService-TS_20130730111207.log" attr="" comment="" date="1375175769" name="WMSService-TS_20130730111207.log" path="WMSService-TS_20130730111207.log" size="5096" user="FabioCapannini" version="1"
META FILEATTACHMENT attachment="WMSService-TS_20130730113927.log" attr="" comment="" date="1375178133" name="WMSService-TS_20130730113927.log" path="WMSService-TS_20130730113927.log" size="16801" user="FabioCapannini" version="1"

Revision 42013-07-29 - FabioCapannini

Line: 1 to 1
 
META TOPICPARENT name="WMSTaskIGIRTC-158"

WMS v. 3.6.0 (SL6) test report - CNAF UPDATE

Line: 78 to 78
 
Changed:
<
<
Jdl attributes - PASSED
>
>
Jdl attributes - MOSTLY PASSED
[capannini@emitestbed54 WMS-service]$ python WMS-jdl-attributes-job-cycle.py -c wms-command.conf -V testers.eu-emi.eu -d 3 -l -i -t 1,2,5,6,7
===> +++++++++++++++++++++++++++++++++++++++++++++++++++++
===> + TestSuite of the WMS Service                       
===> + Description: Test a complete job cycle for normal job with non default jdl files 
===> +++++++++++++++++++++++++++++++++++++++++++++++++++++

Enter the user proxy password:

 Test 1: Jdl with AllowZippedISB - CE_CREAM 

===> ERROR: Message Archiving the ISB files not found

 Test 2: Jdl with ExpiryTime 


 Test 5: Jdl with InputSandboxBaseURI 


 Test 5: Jdl with InputSandboxBaseURI - CE_CREAM 


 Test 6: Jdl with OutputSandboxBaseDestURI 


 Test 6: Jdl with OutputSandboxBaseDestURI - CE_CREAM 


 Test 7: Jdl with OutputSandboxDestURI 


 Test 7: Jdl with OutputSandboxDestURI - CE_CREAM 

===> 
===> Test: WMS-jdl-attributes-job-cycle.py
===> WMS: emitestbed44.cnaf.infn.it
===> Started: 15:38:05
===> Ended  : 15:48:31
===> 
===>     >>> TEST FAILED <<<
===> 
===>  >>> failure reason: 1 test(s) fail(s): ['Test 1: Jdl with AllowZippedISB'] <<< 
===> 
===> Test log file is WMSService-TS_20130729153805.log

[capannini@emitestbed54 WMS-service]$ python WMS-jdl-attributes-job-cycle.py -c wms-command.conf -V testers.eu-emi.eu -d 3 -l -i -t 7
===> +++++++++++++++++++++++++++++++++++++++++++++++++++++
===> + TestSuite of the WMS Service                       
===> + Description: Test a complete job cycle for normal job with non default jdl files 
===> +++++++++++++++++++++++++++++++++++++++++++++++++++++

Enter the user proxy password:

 Test 7: Jdl with OutputSandboxDestURI 


 Test 7: Jdl with OutputSandboxDestURI - CE_CREAM 

===> 
===> Test: WMS-jdl-attributes-job-cycle.py
===> WMS: emitestbed44.cnaf.infn.it
===> Started: 16:05:19
===> Ended  : 16:07:33
===> 
===>     === test PASSED === 
===> 
===> Test log file is WMSService-TS_20130729160519.log

 

Collection

Bulk submission -
Line: 112 to 185
 
META FILEATTACHMENT attachment="EMI3_WMS_update_3_6_0.log" attr="" comment="" date="1375044374" name="EMI3_WMS_update_3_6_0.log" path="EMI3_WMS_update_3_6_0.log" size="330992" user="CristinaAiftimiei" version="1"
META FILEATTACHMENT attachment="WMSService-TS_20130729144930.log" attr="" comment="" date="1375102388" name="WMSService-TS_20130729144930.log" path="WMSService-TS_20130729144930.log" size="4606" user="FabioCapannini" version="1"
META FILEATTACHMENT attachment="WMSService-TS_20130729145710.log" attr="" comment="" date="1375102864" name="WMSService-TS_20130729145710.log" path="WMSService-TS_20130729145710.log" size="6103" user="FabioCapannini" version="1"
Added:
>
>
META FILEATTACHMENT attachment="WMSService-TS_20130729153805.log" attr="" comment="" date="1375107161" name="WMSService-TS_20130729153805.log" path="WMSService-TS_20130729153805.log" size="34023" user="FabioCapannini" version="1"
META FILEATTACHMENT attachment="WMSService-TS_20130729160519.log" attr="" comment="" date="1375107172" name="WMSService-TS_20130729160519.log" path="WMSService-TS_20130729160519.log" size="8058" user="FabioCapannini" version="1"

Revision 32013-07-29 - FabioCapannini

Line: 1 to 1
 
META TOPICPARENT name="WMSTaskIGIRTC-158"

WMS v. 3.6.0 (SL6) test report - CNAF UPDATE

Line: 21 to 21
 

Added:
>
>
It is necessary to downgrade gridsite, as there is a known issue in version 2.1.0:
Delegation IDs containing non-alphanumeric characters other than a dot, coma or underscore are rejected.
yum downgrade gridsite\*
 

Unit Tests - PASSED

Basic Functionality tests

Submission

Normal - PASSED

Added:
>
>
[capannini@emitestbed54 WMS-service]$ python WMS-job-cycle.py -c wms-command.conf -V testers.eu-emi.eu -d 3 -l -t 1 -i
===> +++++++++++++++++++++++++++++++++++++++++++++++++++++
===> + TestSuite of the WMS Service                       
===> + Description: Test a complete job cycle: from submission to get output 
===> +++++++++++++++++++++++++++++++++++++++++++++++++++++

Enter the user proxy password:

 Set 1: Submit a normal job - CE_CREAM 

===> 
===> Test: WMS-job-cycle.py
===> WMS: emitestbed44.cnaf.infn.it
===> Started: 14:57:10
===> Ended  : 14:59:55
===> 
===>     === test PASSED === 
===> 
===> Test log file is WMSService-TS_20130729145710.log
 
Proxy Mode - PASSED
Added:
>
>
[capannini@emitestbed54 WMS-service]$ python WMS-job-cycle.py -c wms-command.conf -V testers.eu-emi.eu -d 3 -l -t 1 -i
===> +++++++++++++++++++++++++++++++++++++++++++++++++++++
===> + TestSuite of the WMS Service                       
===> + Description: Test a complete job cycle: from submission to get output 
===> +++++++++++++++++++++++++++++++++++++++++++++++++++++

Enter the user proxy password:

 Set 1: Submit a normal job - CE_CREAM 

===> 
===> Test: WMS-job-cycle.py
===> WMS: emitestbed44.cnaf.infn.it
===> Started: 14:49:30
===> Ended  : 14:51:20
===> 
===>     === test PASSED === 
===> 
===> Test log file is WMSService-TS_20130729144930.log
 
Jdl attributes - PASSED

Line: 58 to 107
 

Bugs attached to this task

Added:
>
>
 
META FILEATTACHMENT attachment="EMI3_WMS_update_3_6_0.log" attr="" comment="" date="1375044374" name="EMI3_WMS_update_3_6_0.log" path="EMI3_WMS_update_3_6_0.log" size="330992" user="CristinaAiftimiei" version="1"
Added:
>
>
META FILEATTACHMENT attachment="WMSService-TS_20130729144930.log" attr="" comment="" date="1375102388" name="WMSService-TS_20130729144930.log" path="WMSService-TS_20130729144930.log" size="4606" user="FabioCapannini" version="1"
META FILEATTACHMENT attachment="WMSService-TS_20130729145710.log" attr="" comment="" date="1375102864" name="WMSService-TS_20130729145710.log" path="WMSService-TS_20130729145710.log" size="6103" user="FabioCapannini" version="1"

Revision 12013-07-23 - CristinaAiftimiei

Line: 1 to 1
Added:
>
>
META TOPICPARENT name="WMSTaskIGIRTC-158"

WMS v. 3.6.0 (SL6) test report - CNAF UPDATE

Summary

  • Component: WMS 3.6.0

  • VCS Tag:

  • EMI Major Release: EMI 3

  • Platform: SL6/x86_64 + EPEL

  • Outcome: Ongoing

Deployment Tests

Upgrade - PASSED

Unit Tests - PASSED

Basic Functionality tests

Submission

Normal - PASSED

Proxy Mode - PASSED

Jdl attributes - PASSED

Collection

Bulk submission -
All in a jdl -

Parametric job -

Dag -

Parallel job -

Forwarding parameters for parallel jobs -

Perusal -

Delegation -

List-match -

Prologue and epilogue jobs -

Shallow and deep resubmission -

Cancel -

Limiter mechanism - MOSTLY PASSED (SAME FAILURES AS IN EMI1)

Job purge -

Configuration file -

Proxy renewal -

Feedback -

Published information -

bdb database information

Stats database definitions

Performance test

Stress test

Regression tests

Bugs attached to this task

 
This site is powered by the TWiki collaboration platformCopyright © 2008-2019 by the contributing authors. All material on this collaboration platform is the property of the contributing authors.
Ideas, requests, problems regarding TWiki? Send feedback