Difference: WMSTaskIGIRTC166 (11 vs. 12)

Revision 122013-11-12 - FabioCapannini

Line: 1 to 1
 

WMS 3.6.1 test report - IGIRTC-166

Line: 641 to 641
 
Changed:
<
<

Regression tests

>
>

Regression tests - SOME FAILURES

 
[capannini@emitestbed54 regression]$ pybot ~/git/WMS-Test-Suite/robot_testsuites/regression_tests/testsuites/
==============================================================================
Line: 932 to 932
 
Added:
>
>
[capannini@emitestbed54 regression]$ pybot -e 100176 -e 27215 -e 27899 -e 28235 -e 28637 -e 28642 -e 30896 -e 30900 -e 31012 -e 31278 -e 31669 -e 32078 -e 32611 -e 34420 -e 34508 -e 35250 -e 36145 -e 36292 -e 36536 -e 38359 -e 38739 -e 40982 -e 44599 -e 45883 -e 48068 -e 48636 -e 50009 -e 52617 -e 53294 -e 54728 -e 55814 -e 56734 -e 58878 ~/git/WMS-Test-Suite/robot_testsuites/regression_tests/testsuites/
==============================================================================
Testsuites                                                                    
==============================================================================
Testsuites.58968 :: Request for handling SMPGranularity attribute in the JDL  
==============================================================================
bug 58968                                                             | PASS |
------------------------------------------------------------------------------
Testsuites.58968 :: Request for handling SMPGranularity attribute ... | PASS |
1 critical test, 1 passed, 0 failed
1 test total, 1 passed, 0 failed
==============================================================================
Testsuites.61315 :: [ yaim-wms ] CeForwardParameters should include several...
==============================================================================
bug 61315                                                             | PASS |
------------------------------------------------------------------------------
Testsuites.61315 :: [ yaim-wms ] CeForwardParameters should includ... | PASS |
1 critical test, 1 passed, 0 failed
1 test total, 1 passed, 0 failed
==============================================================================
Testsuites.62211 :: [ yaim-wms ] Enable Glue 2.0 publishing                   
==============================================================================
bug 62211                                                             | FAIL |
GeneralError: 'sh: svn: command not found'
------------------------------------------------------------------------------
Testsuites.62211 :: [ yaim-wms ] Enable Glue 2.0 publishing           | FAIL |
1 critical test, 0 passed, 1 failed
1 test total, 0 passed, 1 failed
==============================================================================
Testsuites.64416 :: The proxycache purger needs to be made compatible with ...
==============================================================================
bug 64416                                                             | FAIL |
GeneralError: 'Unable to find any expired proxy to test the proxycache purger operation'
------------------------------------------------------------------------------
Testsuites.64416 :: The proxycache purger needs to be made compati... | FAIL |
1 critical test, 0 passed, 1 failed
1 test total, 0 passed, 1 failed
==============================================================================
Testsuites.67489 :: WMS needs cron job to kill stale GridFTP processes        
==============================================================================
bug 67489                                                             | PASS |
------------------------------------------------------------------------------
Testsuites.67489 :: WMS needs cron job to kill stale GridFTP proce... | PASS |
1 critical test, 1 passed, 0 failed
1 test total, 1 passed, 0 failed
==============================================================================
Testsuites.68944 :: Bug in ICE's start/stop script                            
==============================================================================
bug 68944                                                             | PASS |
------------------------------------------------------------------------------
Testsuites.68944 :: Bug in ICE's start/stop script                    | PASS |
1 critical test, 1 passed, 0 failed
1 test total, 1 passed, 0 failed
==============================================================================
Testsuites.70061 :: WMS hates collections with 192 nodes!                     
==============================================================================
bug 70061                                                             | PASS |
------------------------------------------------------------------------------
Testsuites.70061 :: WMS hates collections with 192 nodes!             | PASS |
1 critical test, 1 passed, 0 failed
1 test total, 1 passed, 0 failed
==============================================================================
Testsuites.70331 :: glite-wms-create-proxy "ambiguous redirect"               
==============================================================================
bug 70331                                                             | PASS |
------------------------------------------------------------------------------
Testsuites.70331 :: glite-wms-create-proxy "ambiguous redirect"       | PASS |
1 critical test, 1 passed, 0 failed
1 test total, 1 passed, 0 failed
==============================================================================
Testsuites.70824 :: Environment values in JDL cannot have spaces              
==============================================================================
bug 70824                                                             ...
 Test for CE: /cream- 

bug 70824                                                             | FAIL |
GeneralError: 'Timeout reached while waiting the job https://emitestbed44.cnaf.infn.it:9000/wLeU1fgswwQwsplTjoq45A to finish'
------------------------------------------------------------------------------
Testsuites.70824 :: Environment values in JDL cannot have spaces      | FAIL |
1 critical test, 0 passed, 1 failed
1 test total, 0 passed, 1 failed
==============================================================================
Testsuites.71863 :: JobWrapper tries to use "test -eq" for string comparison  
==============================================================================
bug 71863                                                             | PASS |
------------------------------------------------------------------------------
Testsuites.71863 :: JobWrapper tries to use "test -eq" for string ... | PASS |
1 critical test, 1 passed, 0 failed
1 test total, 1 passed, 0 failed
==============================================================================
Testsuites.72280 :: WMProxy limiter should log more at info level             
==============================================================================
bug 72280                                                             | FAIL |
GeneralError: u'Command glite-wms-job-submit -a --config /home/capannini/certificazione/WMSTaskIGIRTC166/regression/regression-tests_Testsuites.72280_20131111183819/wms.conf /home/capannini/certificazione/WMSTaskIGIRTC166/regression/regression-tests_Testsuites.72280_20131111183819/example.jdl not failed as expected'
------------------------------------------------------------------------------
Testsuites.72280 :: WMProxy limiter should log more at info level     | FAIL |
1 critical test, 0 passed, 1 failed
1 test total, 0 passed, 1 failed
==============================================================================
Testsuites.73192 :: Submission failed due to a credential problem             
==============================================================================
bug 73192                                                             | PASS |
------------------------------------------------------------------------------
Testsuites.73192 :: Submission failed due to a credential problem     | PASS |
1 critical test, 1 passed, 0 failed
1 test total, 1 passed, 0 failed
==============================================================================
Testsuites.73699 :: Wrong retry count computation                             
==============================================================================
bug 73699                                                             | FAIL |
GeneralError: '\nError - Operation failed\nUnable to find any endpoint where to perform service request\n'
------------------------------------------------------------------------------
Testsuites.73699 :: Wrong retry count computation                     | FAIL |
1 critical test, 0 passed, 1 failed
1 test total, 0 passed, 1 failed
==============================================================================
Testsuites.73711 :: edg_wll_SetLoggingJobProxy with empty sequence code ret...
==============================================================================
[ WARN ] To verify this bug you need a WMS set in proxy mode only             
bug 73711                                                             | FAIL |
GeneralError: '\nError - Operation failed\nUnable to find any endpoint where to perform service request\n'
------------------------------------------------------------------------------
Testsuites.73711 :: edg_wll_SetLoggingJobProxy with empty sequence... | FAIL |
1 critical test, 0 passed, 1 failed
1 test total, 0 passed, 1 failed
==============================================================================
Testsuites.73715 :: Missing ReallyRunning event from LogMonitor               
==============================================================================
bug 73715                                                             | FAIL |
GeneralError: '\nError - Operation failed\nUnable to find any endpoint where to perform service request\n'
------------------------------------------------------------------------------
Testsuites.73715 :: Missing ReallyRunning event from LogMonitor       | FAIL |
1 critical test, 0 passed, 1 failed
1 test total, 0 passed, 1 failed
==============================================================================
Testsuites.74259 :: Previous matches information is not taken into account ...
==============================================================================
bug 74259                                                             | FAIL |
GeneralError: '\nError - Operation failed\nUnable to find any endpoint where to perform service request\n'
------------------------------------------------------------------------------
Testsuites.74259 :: Previous matches information is not taken into... | FAIL |
1 critical test, 0 passed, 1 failed
1 test total, 0 passed, 1 failed
==============================================================================
Testsuites.74577 :: Wrong counter in ICE database is set at the job creation  
==============================================================================
bug 74577                                                             | FAIL |
GeneralError: '\nError - Operation failed\nUnable to find any endpoint where to perform service request\n'
------------------------------------------------------------------------------
Testsuites.74577 :: Wrong counter in ICE database is set at the jo... | FAIL |
1 critical test, 0 passed, 1 failed
1 test total, 0 passed, 1 failed
==============================================================================
Testsuites.74832 :: Files specified with absolute paths shouldn't be used w...
==============================================================================
bug 74832                                                             | FAIL |
GeneralError: '-----------------------------------------\n11 Nov 2013, 18:38:29 -I- PID: 26714 (Debug) - Vo read from proxy certificate extension\n-----------------------------------------\n-----------------------------------------\n11 Nov 2013, 18:38:29 -I- PID: 26714 (Debug) - VirtualOrganisation value : testers.eu-emi.eu\n-----------------------------------------\n-----------------------------------------\n11 Nov 2013, 18:38:29 -I- PID: 26714 (Debug) - Loaded user configuration file:\n /home/capannini/certificazione/WMSTaskIGIRTC166/regression/regression-tests_Testsuites.74832_20131111183829/wms.conf\n-----------------------------------------\n-----------------------------------------\n11 Nov 2013, 18:38:29 -I- PID: 26714 (Debug) - Configuration file: //etc/glite-wms/testers.eu-emi.eu/glite_wmsui.conf - VirtualOrganisation, MyProxyServer attribute(s) no more supported outside JDL Default Attributes section "JdlDefaultAttributes"\n-----------------------------------------\n-----------------------------------------\n11 Nov 2013, 18:38:29 -I- PID: 26714 (Debug) - Loaded Vo specific configuration file:\n //etc/glite-wms/testers.eu-emi.eu/glite_wmsui.conf\n-----------------------------------------\n-----------------------------------------\n11 Nov 2013, 18:38:29 -I- PID: 26714 (Debug) - Loaded Configuration values: \n [\n  JdlDefaultAttributes = \n   [\n    SignificantAttributes = { "Requirements","Rank" }; \n    VirtualOrganisation = "testers.eu-emi.eu"; \n    Rank =  -other.GlueCEStateEstimatedResponseTime; \n    Requirements = oth...
    [ Message content over the limit has been removed. ]
...tput.out","error.err","fstab","grid-mapfile","groupmapfile","passwd" }; InputSandbox = { "file:///etc/fstab","grid-mapfile","groupmapfile","gsiftp://emitestbed41.cnaf.infn.it/etc/passwd" }; StdError = "error.err"; InputSandboxBaseURI = "gsiftp://emitestbed41.cnaf.infn.it/etc/grid-security/"; rank =  -other.GlueCEStateEstimatedResponseTime; requirements = other.GlueCEStateStatus == "Production" ]\n-----------------------------------------\n-----------------------------------------\n11 Nov 2013, 18:38:29 -I- PID: 26714 (Debug) - Registering the job to the service https://emitestbed44.cnaf.infn.it:7443/glite_wms_wmproxy_server\n-----------------------------------------\n-----------------------------------------\n11 Nov 2013, 18:38:29 -I- PID: 26714 (Debug) - Calling the WMProxy jobRegister service\n-----------------------------------------\n\nWarning - Unable to register the job to the service: https://emitestbed44.cnaf.infn.it:7443/glite_wms_wmproxy_server\nSystem load is too high:\nThreshold for Load Average(1 min): 0.0001 => Detected value for Load Average(1 min):  0.07\n\nError code: SOAP-ENV:Server\n\n-----------------------------------------\n11 Nov 2013, 18:38:30 -I- PID: 26714 (Debug) - Skip Service Discovery query: disabled by user configuration settings \n-----------------------------------------\n\nError - Operation failed\nUnable to find any endpoint where to perform service request\n\n\nPossible Errors and Debug messages have been printed in the following file:\n/tmp/glite-wms-job-submit_501_26714_20131111_18-38-29.log\n'
------------------------------------------------------------------------------
Testsuites.74832 :: Files specified with absolute paths shouldn't ... | FAIL |
1 critical test, 0 passed, 1 failed
1 test total, 0 passed, 1 failed
==============================================================================
Testsuites.75223 :: wrong reason logged                                       
==============================================================================
bug 75223                                                             | FAIL |
GeneralError: '\nError - Operation failed\nUnable to find any endpoint where to perform service request\n'
------------------------------------------------------------------------------
Testsuites.75223 :: wrong reason logged                               | FAIL |
1 critical test, 0 passed, 1 failed
1 test total, 0 passed, 1 failed
==============================================================================
Testsuites.75368 :: ICE should log a DONE_FAILED to LB every time the job i...
==============================================================================
bug 75368                                                             | FAIL |
GeneralError: '\nError - Operation failed\nUnable to find any endpoint where to perform service request\n'
------------------------------------------------------------------------------
Testsuites.75368 :: ICE should log a DONE_FAILED to LB every time ... | FAIL |
1 critical test, 0 passed, 1 failed
1 test total, 0 passed, 1 failed
==============================================================================
Testsuites.75802 :: Title: Too much flexibility in JDL syntax                 
==============================================================================
bug 75802                                                             | FAIL |
GeneralError: 'Inserting {"FOO=bar"}\n\nError - Operation failed\nUnable to find any endpoint where to perform service request\n'
------------------------------------------------------------------------------
Testsuites.75802 :: Title: Too much flexibility in JDL syntax         | FAIL |
1 critical test, 0 passed, 1 failed
1 test total, 0 passed, 1 failed
==============================================================================
Testsuites.77004 :: Wrong myproxyserver string processing in ICE              
==============================================================================
bug 77004                                                             | FAIL |
GeneralError: '\nError - Operation failed\nUnable to find any endpoint where to perform service request\n'
------------------------------------------------------------------------------
Testsuites.77004 :: Wrong myproxyserver string processing in ICE      | FAIL |
1 critical test, 0 passed, 1 failed
1 test total, 0 passed, 1 failed
==============================================================================
Testsuites.77055 :: "MyProxyServer: wrong type caught for attribute" for pa...
==============================================================================
bug 77055                                                             | FAIL |
GeneralError: '\nError - Operation failed\nUnable to find any endpoint where to perform service request\n'
------------------------------------------------------------------------------
Testsuites.77055 :: "MyProxyServer: wrong type caught for attribut... | FAIL |
1 critical test, 0 passed, 1 failed
1 test total, 0 passed, 1 failed
==============================================================================
Testsuites.77694 :: Resource BDII for WMS needs to be revisit                 
==============================================================================
bug 77694                                                             | PASS |
------------------------------------------------------------------------------
Testsuites.77694 :: Resource BDII for WMS needs to be revisit         | PASS |
1 critical test, 1 passed, 0 failed
1 test total, 1 passed, 0 failed
==============================================================================
Testsuites.77876 :: While purging DAGs/Collections the CLEAR event is only ...
==============================================================================
bug 77876                                                             | FAIL |
GeneralError: '\nError - Operation failed\nUnable to find any endpoint where to perform service request\n'
------------------------------------------------------------------------------
Testsuites.77876 :: While purging DAGs/Collections the CLEAR event... | FAIL |
1 critical test, 0 passed, 1 failed
1 test total, 0 passed, 1 failed
==============================================================================
Testsuites.78047 :: LB Query timeout                                          
==============================================================================
bug 78047                                                             | FAIL |
GeneralError: '\nError - Operation failed\nUnable to find any endpoint where to perform service request\n'
------------------------------------------------------------------------------
Testsuites.78047 :: LB Query timeout                                  | FAIL |
1 critical test, 0 passed, 1 failed
1 test total, 0 passed, 1 failed
==============================================================================
Testsuites.78406 :: [ yaim-wms ] yaim should set IsmIiLDAPCEFilterExt accor...
==============================================================================
bug 78406                                                             | PASS |
------------------------------------------------------------------------------
Testsuites.78406 :: [ yaim-wms ] yaim should set IsmIiLDAPCEFilter... | PASS |
1 critical test, 1 passed, 0 failed
1 test total, 1 passed, 0 failed
==============================================================================
Testsuites.78484 :: [ YAIM_WMS ] Multiple parameter configuration added in ...
==============================================================================
bug 78484                                                             | FAIL |
GeneralError: 'Error while executing remote command => cat /opt/condor-c/local.emitestbed44/condor_config.local'
------------------------------------------------------------------------------
Testsuites.78484 :: [ YAIM_WMS ] Multiple parameter configuration ... | FAIL |
1 critical test, 0 passed, 1 failed
1 test total, 0 passed, 1 failed
==============================================================================
Testsuites.79141 :: various bugs about parametric jobs                        
==============================================================================
bug 79141                                                             | FAIL |
GeneralError: "\nError - \nInputSandbox: Specified path 'data/79141/Test0' is missing\n"
------------------------------------------------------------------------------
Testsuites.79141 :: various bugs about parametric jobs                | FAIL |
1 critical test, 0 passed, 1 failed
1 test total, 0 passed, 1 failed
==============================================================================
Testsuites.81376 :: glite-wms-wmproxy.restart.cron MUST support graceful wm...
==============================================================================
bug 81376                                                             | PASS |
------------------------------------------------------------------------------
Testsuites.81376 :: glite-wms-wmproxy.restart.cron MUST support gr... | PASS |
1 critical test, 1 passed, 0 failed
1 test total, 1 passed, 0 failed
==============================================================================
Testsuites.81568 :: some inconsistencies in locations for logs and configur...
==============================================================================
bug 81568                                                             | FAIL |
GeneralError: 'Error !!! Environment  variable WMS_LOCATION_LOG is /var/log/wms instead of /var/log/glite'
------------------------------------------------------------------------------
Testsuites.81568 :: some inconsistencies in locations for logs and... | FAIL |
1 critical test, 0 passed, 1 failed
1 test total, 0 passed, 1 failed
==============================================================================
Testsuites.81651 :: Cancellation of a dag's node doesn't work                 
==============================================================================
bug 81651                                                             | FAIL |
GeneralError: '\nError - Operation failed\nUnable to find any endpoint where to perform service request\n'
------------------------------------------------------------------------------
Testsuites.81651 :: Cancellation of a dag's node doesn't work         | FAIL |
1 critical test, 0 passed, 1 failed
1 test total, 0 passed, 1 failed
==============================================================================
Testsuites.82687 :: EMI WMS problems with ISB tar file handling               
==============================================================================
bug 82687                                                             | FAIL |
GeneralError: '\nError - Operation failed\nUnable to find any endpoint where to perform service request\n'
------------------------------------------------------------------------------
Testsuites.82687 :: EMI WMS problems with ISB tar file handling       | FAIL |
1 critical test, 0 passed, 1 failed
1 test total, 0 passed, 1 failed
==============================================================================
Testsuites.82776 :: Typo in WMS jobwrapper                                    
==============================================================================
bug 82776                                                             | PASS |
------------------------------------------------------------------------------
Testsuites.82776 :: Typo in WMS jobwrapper                            | PASS |
1 critical test, 1 passed, 0 failed
1 test total, 1 passed, 0 failed
==============================================================================
Testsuites.82983 :: [yaim-wms] authorization problem in WMS EMI-1             
==============================================================================
bug 82983                                                             | PASS |
------------------------------------------------------------------------------
Testsuites.82983 :: [yaim-wms] authorization problem in WMS EMI-1     | PASS |
1 critical test, 1 passed, 0 failed
1 test total, 1 passed, 0 failed
==============================================================================
Testsuites.82995 :: glite-wms-job-status needs a json-compliant format        
==============================================================================
bug 82995                                                             | FAIL |
GeneralError: '\nError - Operation failed\nUnable to find any endpoint where to perform service request\n'
------------------------------------------------------------------------------
Testsuites.82995 :: glite-wms-job-status needs a json-compliant fo... | FAIL |
1 critical test, 0 passed, 1 failed
1 test total, 0 passed, 1 failed
==============================================================================
Testsuites.83062 :: [yaim-wms] A different template should be used for glue...
==============================================================================
bug 83062                                                             | FAIL |
GeneralError: 'sh: svn: command not found'
------------------------------------------------------------------------------
Testsuites.83062 :: [yaim-wms] A different template should be used... | FAIL |
1 critical test, 0 passed, 1 failed
1 test total, 0 passed, 1 failed
==============================================================================
Testsuites.83453 :: Deregistration of a proxy (2)                             
==============================================================================
bug 83453                                                             | FAIL |
GeneralError: '\nError - Operation failed\nUnable to find any endpoint where to perform service request\n'
------------------------------------------------------------------------------
Testsuites.83453 :: Deregistration of a proxy (2)                     | FAIL |
1 critical test, 0 passed, 1 failed
1 test total, 0 passed, 1 failed
==============================================================================
Testsuites.84155 :: Internal proxy structure convertion error in ICE          
==============================================================================
bug 84155                                                             | FAIL |
GeneralError: '\nError - Operation failed\nUnable to find any endpoint where to perform service request\n'
------------------------------------------------------------------------------
Testsuites.84155 :: Internal proxy structure convertion error in ICE  | FAIL |
1 critical test, 0 passed, 1 failed
1 test total, 0 passed, 1 failed
==============================================================================
Testsuites.84839 :: Last LB event logged by ICE when job aborted for proxy ...
==============================================================================
bug 84839                                                             | FAIL |
GeneralError: '\nError - Operation failed\nUnable to find any endpoint where to perform service request\n'
------------------------------------------------------------------------------
Testsuites.84839 :: Last LB event logged by ICE when job aborted f... | FAIL |
1 critical test, 0 passed, 1 failed
1 test total, 0 passed, 1 failed
==============================================================================
Testsuites.85071 :: Wmproxy authorization breaks with longer proxy chain      
==============================================================================
bug 85071                                                             ...Enter GRID pass phrase for this identity:

 Interactive test 

bug 85071                                                             | FAIL |
GeneralError: 'Your identity: /C=IT/O=INFN/OU=Personal Certificate/L=CNAF/CN=Fabio Capannini\nCreating proxy ....................................................................................................................... Done\nProxy Verify OK\nYour proxy is valid until: Tue Nov 19 10:09:56 2013\nFailed reading length 0\nError authenticating: Connection closed.'
------------------------------------------------------------------------------
Testsuites.85071 :: Wmproxy authorization breaks with longer proxy... | FAIL |
1 critical test, 0 passed, 1 failed
1 test total, 0 passed, 1 failed
==============================================================================
Testsuites.85327 :: [yaim-wms] yaim changes ownership of /var                 
==============================================================================
bug 85327                                                             | PASS |
------------------------------------------------------------------------------
Testsuites.85327 :: [yaim-wms] yaim changes ownership of /var         | PASS |
1 critical test, 1 passed, 0 failed
1 test total, 1 passed, 0 failed
==============================================================================
Testsuites.85799 :: [ yaim-wms ] yaim should set IsmIiLDAPCEFilterExt accor...
==============================================================================
bug 85799                                                             | FAIL |
GeneralError: 'Unable to find wmproxy-api-cpp.pc file'
------------------------------------------------------------------------------
Testsuites.85799 :: [ yaim-wms ] yaim should set IsmIiLDAPCEFilter... | FAIL |
1 critical test, 0 passed, 1 failed
1 test total, 0 passed, 1 failed
==============================================================================
Testsuites.86267 :: queryDb has 2 bugs handling user options (see ggus tick...
==============================================================================
bug 86267                                                             | PASS |
------------------------------------------------------------------------------
Testsuites.86267 :: queryDb has 2 bugs handling user options (see ... | PASS |
1 critical test, 1 passed, 0 failed
1 test total, 1 passed, 0 failed
==============================================================================
Testsuites.86485 :: ICE doesn't send the iceId to CREAM                       
==============================================================================
[ WARN ] To verify this bug you need access to a CREAM CE and to WMS          
bug 86485                                                             | FAIL |
GeneralError: 'To verify this bug it is necessary to set WMS_USERNAME,WMS_PASSWORD,OTHER_HOST,USERNAME and PASSWORD in the configuration file'
------------------------------------------------------------------------------
Testsuites.86485 :: ICE doesn't send the iceId to CREAM               | FAIL |
1 critical test, 0 passed, 1 failed
1 test total, 0 passed, 1 failed
==============================================================================
Testsuites.86490 :: EMI WMS stops accepting jobs after 31999th submission f...
==============================================================================
bug 86490                                                             | PASS |
------------------------------------------------------------------------------
Testsuites.86490 :: EMI WMS stops accepting jobs after 31999th sub... | PASS |
1 critical test, 1 passed, 0 failed
1 test total, 1 passed, 0 failed
==============================================================================
Testsuites.86682 :: [yaim-wms] yaim changes ownership of /var                 
==============================================================================
bug 86682                                                             | PASS |
------------------------------------------------------------------------------
Testsuites.86682 :: [yaim-wms] yaim changes ownership of /var         | PASS |
1 critical test, 1 passed, 0 failed
1 test total, 1 passed, 0 failed
==============================================================================
Testsuites.87259 :: WMS purger leaves sandboxes untouched in case LB status...
==============================================================================
bug 87259                                                             | FAIL |
GeneralError: '\nError - Proxy validity Error\nYour proxy credential has expired\n'
------------------------------------------------------------------------------
Testsuites.87259 :: WMS purger leaves sandboxes untouched in case ... | FAIL |
1 critical test, 0 passed, 1 failed
1 test total, 0 passed, 1 failed
==============================================================================
Testsuites.87261 :: WMproxy GACLs do not support wildcards (as they used to...
==============================================================================
bug 87261                                                             | FAIL |
GeneralError: '\nError - Proxy validity Error\nYour proxy credential has expired\n'
------------------------------------------------------------------------------
Testsuites.87261 :: WMproxy GACLs do not support wildcards (as the... | FAIL |
1 critical test, 0 passed, 1 failed
1 test total, 0 passed, 1 failed
==============================================================================
Testsuites.87444 :: glite-wms-job-list-match --help show an un-implemented ...
==============================================================================
bug 87444                                                             | PASS |
------------------------------------------------------------------------------
Testsuites.87444 :: glite-wms-job-list-match --help show an un-imp... | PASS |
1 critical test, 1 passed, 0 failed
1 test total, 1 passed, 0 failed
==============================================================================
Testsuites.87994 :: yaim-wms doesn't fill the attributes get_acbr and get_o...
==============================================================================
bug 87994                                                             | FAIL |
GeneralError: 'To verify this bug it is necessary to set the YAIM_FILE in the configuration file'
------------------------------------------------------------------------------
Testsuites.87994 :: yaim-wms doesn't fill the attributes get_acbr ... | FAIL |
1 critical test, 0 passed, 1 failed
1 test total, 0 passed, 1 failed
==============================================================================
Testsuites.88072 :: EMI-1 WMS cannot submit to ARC CEs                        
==============================================================================
bug 88072                                                             | FAIL |
GeneralError: '\nError - Proxy validity Error\nYour proxy credential has expired\n'
------------------------------------------------------------------------------
Testsuites.88072 :: EMI-1 WMS cannot submit to ARC CEs                | FAIL |
1 critical test, 0 passed, 1 failed
1 test total, 0 passed, 1 failed
==============================================================================
Testsuites.88128 :: Submission with rfc proxy doesn't work                    
==============================================================================
bug 88128                                                             | FAIL |
GeneralError: '\nError - Operation failed\nUnable to find any endpoint where to perform service request\n'
------------------------------------------------------------------------------
Testsuites.88128 :: Submission with rfc proxy doesn't work            | FAIL |
1 critical test, 0 passed, 1 failed
1 test total, 0 passed, 1 failed
==============================================================================
Testsuites.88450 :: Ice configuration section doesn't use environment variable
==============================================================================
bug 88450                                                             | FAIL |
GeneralError: 'Problem with the following attributes in the ICE section:set([\'ice_host_cert   =   "${GLITE_HOST_CERT};\', \'ice_host_cert   =   "${GLITE_HOST_CERT}";\', \'ice_host_key   =   "${GLITE_HOST_KEY}";\', \'ice_host_key   =   "${GLITE_HOST_KEY};\'])'
------------------------------------------------------------------------------
Testsuites.88450 :: Ice configuration section doesn't use environm... | FAIL |
1 critical test, 0 passed, 1 failed
1 test total, 0 passed, 1 failed
==============================================================================
Testsuites.88558 :: WM creates submit requests with old sequence code upon ...
==============================================================================
bug 88558                                                             | FAIL |
GeneralError: '\nError - Operation failed\nUnable to find any endpoint where to perform service request\n'
------------------------------------------------------------------------------
Testsuites.88558 :: WM creates submit requests with old sequence c... | FAIL |
1 critical test, 0 passed, 1 failed
1 test total, 0 passed, 1 failed
==============================================================================
Testsuites.88569 :: WMS: LCMAPS should log on file only and not on syslog     
==============================================================================
bug 88569                                                             | FAIL |
GeneralError: 'Error while executing remote command => ls -l /var/log/glite/lcmaps.log'
------------------------------------------------------------------------------
Testsuites.88569 :: WMS: LCMAPS should log on file only and not on... | FAIL |
1 critical test, 0 passed, 1 failed
1 test total, 0 passed, 1 failed
==============================================================================
Testsuites.89435 :: GlueServiceStatusInfo: ??                                 
==============================================================================
bug 89435                                                             | PASS |
------------------------------------------------------------------------------
Testsuites.89435 :: GlueServiceStatusInfo: ??                         | PASS |
1 critical test, 1 passed, 0 failed
1 test total, 1 passed, 0 failed
==============================================================================
Testsuites.89506 :: EMI WMS wmproxy rpm doesn't set execution permissions a...
==============================================================================
bug 89506                                                             | FAIL |
GeneralError: "Test failed, execution permissions haven't been set correctly."
------------------------------------------------------------------------------
Testsuites.89506 :: EMI WMS wmproxy rpm doesn't set execution perm... | FAIL |
1 critical test, 0 passed, 1 failed
1 test total, 0 passed, 1 failed
==============================================================================
Testsuites.89508 :: EMI WMS WM might abort resubmitted jobs                   
==============================================================================
bug 89508                                                             | FAIL |
GeneralError: "lcg-infosites: no BDII could be contacted\nlcg-infosites: last BDII tried was 'certtbrc-bdii.cern.ch:2170'\nlcg-infosites: IO::Socket::INET: Bad hostname 'certtbrc-bdii.cern.ch:2170'"
------------------------------------------------------------------------------
Testsuites.89508 :: EMI WMS WM might abort resubmitted jobs           | FAIL |
1 critical test, 0 passed, 1 failed
1 test total, 0 passed, 1 failed
==============================================================================
Testsuites.89577 :: EMI WMS wmproxy init.d script stop/start problems         
==============================================================================
bug 89577                                                             | FAIL |
GeneralError: "Restart command for workload manager proxy don't restart httpd. pids before:   753 , 19555 , 19556 , 19557 , 19558 , 19559 , 19560 , pids after:   753 , 20060 , 20061 , 20062 , 20063 , 20064 , 20065"
------------------------------------------------------------------------------
Testsuites.89577 :: EMI WMS wmproxy init.d script stop/start problems | FAIL |
1 critical test, 0 passed, 1 failed
1 test total, 0 passed, 1 failed
==============================================================================
Testsuites.89674 :: glite-wms-check-daemons.sh should not restart daemons u...
==============================================================================
bug 89674                                                             | FAIL |
GeneralError: "glite-wms-check-daemons.sh script didn't restart workload manager"
------------------------------------------------------------------------------
Testsuites.89674 :: glite-wms-check-daemons.sh should not restart ... | FAIL |
1 critical test, 0 passed, 1 failed
1 test total, 0 passed, 1 failed
==============================================================================
Testsuites.89857 :: Wrong location for PID file                               
==============================================================================
bug 89857                                                             | FAIL |
GeneralError: 'Error while executing remote command => ls /tmp/*.pid'
------------------------------------------------------------------------------
Testsuites.89857 :: Wrong location for PID file                       | FAIL |
1 critical test, 0 passed, 1 failed
1 test total, 0 passed, 1 failed
==============================================================================
Testsuites.89871 :: WMS logs should keep track of the last 90 days            
==============================================================================
bug 89871                                                             | PASS |
------------------------------------------------------------------------------
Testsuites.89871 :: WMS logs should keep track of the last 90 days    | PASS |
1 critical test, 1 passed, 0 failed
1 test total, 1 passed, 0 failed
==============================================================================
Testsuites.90034 :: LB failover mechanism in WMproxy needs to be reviewed     
==============================================================================
bug 90034                                                             | FAIL |
GeneralError: '\nError - Operation failed\nUnable to find any endpoint where to perform service request\n'
------------------------------------------------------------------------------
Testsuites.90034 :: LB failover mechanism in WMproxy needs to be r... | FAIL |
1 critical test, 0 passed, 1 failed
1 test total, 0 passed, 1 failed
==============================================================================
Testsuites.90129 :: yaim-wms creates wms.proxy in wrong path                  
==============================================================================
bug 90129                                                             | PASS |
------------------------------------------------------------------------------
Testsuites.90129 :: yaim-wms creates wms.proxy in wrong path          | PASS |
1 critical test, 1 passed, 0 failed
1 test total, 1 passed, 0 failed
==============================================================================
Testsuites.90640 :: cron job deletes /var/proxycache                          
==============================================================================
bug 90640                                                             | PASS |
------------------------------------------------------------------------------
Testsuites.90640 :: cron job deletes /var/proxycache                  | PASS |
1 critical test, 1 passed, 0 failed
1 test total, 1 passed, 0 failed
==============================================================================
Testsuites.90760 :: yaim-wms changes for Argus based authZ                    
==============================================================================
bug 90760                                                             | FAIL |
GeneralError: 'To verify this bug it is necessary to set the YAIM_FILE in the configuration file'
------------------------------------------------------------------------------
Testsuites.90760 :: yaim-wms changes for Argus based authZ            | FAIL |
1 critical test, 0 passed, 1 failed
1 test total, 0 passed, 1 failed
==============================================================================
Testsuites.90830 :: ICE should use env vars in its configuration              
==============================================================================
bug 90830                                                             | FAIL |
GeneralError: 'Problem with the following attributes in the ICE section:set([\'ice_host_cert   =   "${GLITE_HOST_CERT};\', \'ice_host_cert   =   "${GLITE_HOST_CERT}";\', \'ice_host_key   =   "${GLITE_HOST_KEY}";\', \'ice_host_key   =   "${GLITE_HOST_KEY};\'])'
------------------------------------------------------------------------------
Testsuites.90830 :: ICE should use env vars in its configuration      | FAIL |
1 critical test, 0 passed, 1 failed
1 test total, 0 passed, 1 failed
==============================================================================
Testsuites.91078 :: ICE log verbosity should be reduced to 300                
==============================================================================
bug 91078                                                             | FAIL |
GeneralError: 'Test failed, ICE log verbosity is not 300 as expected but 500'
------------------------------------------------------------------------------
Testsuites.91078 :: ICE log verbosity should be reduced to 300        | FAIL |
1 critical test, 0 passed, 1 failed
1 test total, 0 passed, 1 failed
==============================================================================
Testsuites.91115 :: Make some WMS init scripts System V compatible            
==============================================================================
bug 91115                                                             | PASS |
------------------------------------------------------------------------------
Testsuites.91115 :: Make some WMS init scripts System V compatible    | PASS |
1 critical test, 1 passed, 0 failed
1 test total, 1 passed, 0 failed
==============================================================================
Testsuites.91484 :: move lcmaps.log from /var/log/glite to WMS_LOCATION_LOG   
==============================================================================
bug 91484                                                             | FAIL |
GeneralError: 'Test failed, find lcmaps.log file at directory /var/log/glite'
------------------------------------------------------------------------------
Testsuites.91484 :: move lcmaps.log from /var/log/glite to WMS_LOC... | FAIL |
1 critical test, 0 passed, 1 failed
1 test total, 0 passed, 1 failed
==============================================================================
Testsuites.91486 :: WMS: use logrotate uniformly in ice,lm,jc,wm,wmp          
==============================================================================
bug 91486                                                             | PASS |
------------------------------------------------------------------------------
Testsuites.91486 :: WMS: use logrotate uniformly in ice,lm,jc,wm,wmp  | PASS |
1 critical test, 1 passed, 0 failed
1 test total, 1 passed, 0 failed
==============================================================================
Testsuites.91488 :: remove several dismissed parameters from the WMS config...
==============================================================================
bug 91488                                                             | PASS |
------------------------------------------------------------------------------
Testsuites.91488 :: remove several dismissed parameters from the W... | PASS |
1 critical test, 1 passed, 0 failed
1 test total, 1 passed, 0 failed
==============================================================================
Testsuites.91563 :: yaim-wms: set ldap query filter expression for GLUE2 in...
==============================================================================
bug 91563                                                             | PASS |
------------------------------------------------------------------------------
Testsuites.91563 :: yaim-wms: set ldap query filter expression for... | PASS |
1 critical test, 1 passed, 0 failed
1 test total, 1 passed, 0 failed
==============================================================================
Testsuites.91834 :: Pid file of ICE and WM has glite ownership                
==============================================================================
bug 91834                                                             | PASS |
------------------------------------------------------------------------------
Testsuites.91834 :: Pid file of ICE and WM has glite ownership        | PASS |
1 critical test, 1 passed, 0 failed
1 test total, 1 passed, 0 failed
==============================================================================
Testsuites.91875 :: EMI WMS does not use grid_monitor                         
==============================================================================
bug 91875                                                             | FAIL |
GeneralError: 'Unable to find script /opt/lcg/sbin/grid_monitor.sh'
------------------------------------------------------------------------------
Testsuites.91875 :: EMI WMS does not use grid_monitor                 | FAIL |
1 critical test, 0 passed, 1 failed
1 test total, 0 passed, 1 failed
==============================================================================
Testsuites.91941 :: The job replanner should be configurable                  
==============================================================================
bug 91941                                                             | FAIL |
GeneralError: 'Job replanner is not in action as expected'
------------------------------------------------------------------------------
Testsuites.91941 :: The job replanner should be configurable          | FAIL |
1 critical test, 0 passed, 1 failed
1 test total, 0 passed, 1 failed
==============================================================================
Testsuites.92657 :: some sensible information should be logged on syslog      
==============================================================================
bug 92657                                                             | FAIL |
GeneralError: '\nError - Operation failed\nUnable to find any endpoint where to perform service request\n'
------------------------------------------------------------------------------
Testsuites.92657 :: some sensible information should be logged on ... | FAIL |
1 critical test, 0 passed, 1 failed
1 test total, 0 passed, 1 failed
==============================================================================
Testsuites.92922 :: EMI-1 WMS does not propagate user job exit code           
==============================================================================
bug 92922                                                             | FAIL |
GeneralError: '\nError - Operation failed\nUnable to find any endpoint where to perform service request\n'
------------------------------------------------------------------------------
Testsuites.92922 :: EMI-1 WMS does not propagate user job exit code   | FAIL |
1 critical test, 0 passed, 1 failed
1 test total, 0 passed, 1 failed
==============================================================================
Testsuites.94683 :: Better output message from glite-wms-job-status for mis...
==============================================================================
bug 94683                                                             | FAIL |
GeneralError: '\nError - Operation failed\nUnable to find any endpoint where to perform service request\n'
------------------------------------------------------------------------------
Testsuites.94683 :: Better output message from glite-wms-job-statu... | FAIL |
1 critical test, 0 passed, 1 failed
1 test total, 0 passed, 1 failed
==============================================================================
Testsuites.95584 :: glite-wms-ice-proxy-renew can block undefinitely          
==============================================================================
bug 95584                                                             | FAIL |
GeneralError: '\nError - Operation failed\nUnable to find any endpoint where to perform service request\n'
------------------------------------------------------------------------------
Testsuites.95584 :: glite-wms-ice-proxy-renew can block undefinitely  | FAIL |
1 critical test, 0 passed, 1 failed
1 test total, 0 passed, 1 failed
==============================================================================
Testsuites.96136 :: WMS stops accepting submissions when no swap is available 
==============================================================================
bug 96136                                                             | FAIL |
GeneralError: 'Job submission failed'
------------------------------------------------------------------------------
Testsuites.96136 :: WMS stops accepting submissions when no swap i... | FAIL |
1 critical test, 0 passed, 1 failed
1 test total, 0 passed, 1 failed
==============================================================================
Testsuites.97319 :: Set asyncjobstart=false to avoid lost jobs                
==============================================================================
bug 97319                                                             | PASS |
------------------------------------------------------------------------------
Testsuites.97319 :: Set asyncjobstart=false to avoid lost jobs        | PASS |
1 critical test, 1 passed, 0 failed
1 test total, 1 passed, 0 failed
==============================================================================
Testsuites.98279 :: Job perusal is broken in EMI-2 WMS                        
==============================================================================
bug 98279                                                             | FAIL |
GeneralError: '\nError - Operation failed\nUnable to find any endpoint where to perform service request\n'
------------------------------------------------------------------------------
Testsuites.98279 :: Job perusal is broken in EMI-2 WMS                | FAIL |
1 critical test, 0 passed, 1 failed
1 test total, 0 passed, 1 failed
==============================================================================
Testsuites.98524 :: glite-wms-job-output requires a valid delegated proxy o...
==============================================================================
bug 98524                                                             | FAIL |
GeneralError: '\nError - Operation failed\nUnable to find any endpoint where to perform service request\n'
------------------------------------------------------------------------------
Testsuites.98524 :: glite-wms-job-output requires a valid delegate... | FAIL |
1 critical test, 0 passed, 1 failed
1 test total, 0 passed, 1 failed
==============================================================================
Testsuites.98724 :: Title: ICE removes its pid file at the start() instead ...
==============================================================================
bug 98724                                                             | PASS |
------------------------------------------------------------------------------
Testsuites.98724 :: Title: ICE removes its pid file at the start()... | PASS |
1 critical test, 1 passed, 0 failed
1 test total, 1 passed, 0 failed
==============================================================================
Testsuites.99017 :: wmproxy init script 'status' does not return error when...
==============================================================================
bug 99017                                                             | FAIL |
GeneralError: 'Return value of wmproxy init script is 0 instead of 1 as expected'
------------------------------------------------------------------------------
Testsuites.99017 :: wmproxy init script 'status' does not return e... | FAIL |
1 critical test, 0 passed, 1 failed
1 test total, 0 passed, 1 failed
==============================================================================
Testsuites.Task23845 :: Semi-automated service backends configuration for WMS 
==============================================================================
task 23845                                                            | PASS |
------------------------------------------------------------------------------
Testsuites.Task23845 :: Semi-automated service backends configurat... | PASS |
1 critical test, 1 passed, 0 failed
1 test total, 1 passed, 0 failed
==============================================================================
Testsuites                                                            | FAIL |
88 critical tests, 30 passed, 58 failed
88 tests total, 30 passed, 58 failed
==============================================================================
Output:  /home/capannini/certificazione/WMSTaskIGIRTC166/regression/output.xml
Log:     /home/capannini/certificazione/WMSTaskIGIRTC166/regression/log.html
Report:  /home/capannini/certificazione/WMSTaskIGIRTC166/regression/report.html

 
META FILEATTACHMENT attachment="wms_3_6_1_install_sl6.txt" attr="" comment="install & update packages (SL6)" date="1382970229" name="wms_3_6_1_install_sl6.txt" path="wms_3_6_1_install_sl6.txt" size="356390" user="CristinaAiftimiei" version="1"
META FILEATTACHMENT attachment="wms_3_6_1_update_sl6.txt" attr="" comment="install & update packages (SL6)" date="1382970229" name="wms_3_6_1_update_sl6.txt" path="wms_3_6_1_update_sl6.txt" size="364090" user="CristinaAiftimiei" version="1"
META FILEATTACHMENT attachment="wms_3_6_1_install_sl5.txt" attr="" comment="install & update packages (SL5)" date="1382970362" name="wms_3_6_1_install_sl5.txt" path="wms_3_6_1_install_sl5.txt" size="199639" user="CristinaAiftimiei" version="1"
Line: 959 to 1750
 
META FILEATTACHMENT attachment="log.cancel.tgz" attr="" comment="" date="1383834119" name="log.cancel.tgz" path="log.cancel.tgz" size="147083" user="FabioCapannini" version="1"
META FILEATTACHMENT attachment="log.various.tgz" attr="" comment="" date="1383836585" name="log.various.tgz" path="log.various.tgz" size="135434" user="FabioCapannini" version="1"
META FILEATTACHMENT attachment="log.regression.tgz" attr="" comment="" date="1383927469" name="log.regression.tgz" path="log.regression.tgz" size="282213" user="FabioCapannini" version="1"
Added:
>
>
META FILEATTACHMENT attachment="regression.1.tgz" attr="" comment="" date="1384269240" name="regression.1.tgz" path="regression.1.tgz" size="297566" user="FabioCapannini" version="1"
 
This site is powered by the TWiki collaboration platformCopyright © 2008-2019 by the contributing authors. All material on this collaboration platform is the property of the contributing authors.
Ideas, requests, problems regarding TWiki? Send feedback