Difference: WMSTaskIGIRTC172 (3 vs. 4)

Revision 42014-02-13 - FabioCapannini

Line: 1 to 1
 

WMS 3.6.3 test report - IGIRTC-172

Line: 86 to 86
 
Changed:
<
<

Jdl attributes SOME FAILURES

>
>

Jdl attributes - SOME FAILURES

 
[capannini@emitestbed54 WMSTaskIGIRTC172]$ pybot ~/git/WMS-Test-Suite/robot_testsuites/wms_tests/testsuites/WMS-service/WMS-jdl-attributes-job-cycle.html
==============================================================================
Line: 201 to 201
 
Added:
>
>

Jdl compound job - SOME FAILURES

[capannini@emitestbed54 WMSTaskIGIRTC172]$ pybot ~/git/WMS-Test-Suite/robot_testsuites/wms_tests/testsuites/WMS-service/WMS-jdl-attributes-coumpound-jobs-cycle.html
==============================================================================
WMS-jdl-attributes-coumpound-jobs-cycle :: WMS Jdl Attributes Coumpound Job...
==============================================================================
Check job cycle using DAG job with jdl that contains other DAG        ....
 Check job cycle using DAG job with jdl that contains other DAG - CREAM 

Check job cycle using DAG job with jdl that contains other DAG        | FAIL |
[u"Check job cycle using DAG job with jdl that contains other DAG - CREAM : GeneralError: 'This test is not yet implemented'"]
------------------------------------------------------------------------------
Check job cycle using DAG job and jdl with DefaultNodeRetryCount a... ....
 Check job cycle using DAG job and jdl with DefaultNodeRetryCount attribute - CREAM 

Check job cycle using DAG job and jdl with DefaultNodeRetryCount a... | FAIL |
[u'Check job cycle using DAG job and jdl with DefaultNodeRetryCount attribute - CREAM : GeneralError: "Coumpound job https://emitestbed44.cnaf.infn.it:9000/tFyZnMQ093yLJOyExrv9Lw hasn\'t be correctly resubmitted"']
------------------------------------------------------------------------------
Check job cycle using jobs collection and jdl with DefaultNodeRetr... ....
 Check job cycle using jobs collection and jdl with DefaultNodeRetryCount attribute - CREAM 

Check job cycle using jobs collection and jdl with DefaultNodeRetr... | FAIL |
[u'Check job cycle using jobs collection and jdl with DefaultNodeRetryCount attribute - CREAM : GeneralError: "Coumpound job https://emitestbed44.cnaf.infn.it:9000/_qi5KebrBvvsgFuN7BowgA hasn\'t be correctly resubmitted"']
------------------------------------------------------------------------------
Check job cycle using DAG job and jdl with DefaultNodeShallowRetry... ....
 Check job cycle using DAG job and jdl with DefaultNodeShallowRetryCount attribute - CREAM 

Check job cycle using DAG job and jdl with DefaultNodeShallowRetry... | FAIL |
[u'Check job cycle using DAG job and jdl with DefaultNodeShallowRetryCount attribute - CREAM : RunCommandError: \'Command glite-wms-job-logging-info --event RESUBMISSION https://emitestbed44.cnaf.infn.it:9000/GHqh6KqfZt3vNf6bwwG4pQ failed. Failure message: **** Warning: API_NATIVE_ERROR ****  \\nError while calling the "Eve::queryEvents" native api \\nUnable to retrieve any status information from: emitestbed44.cnaf.infn.it: glite.lb.Exception: edg_wll_QueryEvents: No such file or directory: no matching events found\\n\\tat glite::lb::ServerConnection::queryEvents[./src/ServerConnection.cpp:848]\\n\\n\\n**** Warning: API_NATIVE_ERROR ****  \\nError while calling the "Eve::queryEvents" native api \\nUnable to retrieve any matching information for jobid: https://emitestbed44.cnaf.infn.it:9000/GHqh6KqfZt3vNf6bwwG4pQ\\n\\n\'']
------------------------------------------------------------------------------
Check job cycle using jobs collection and jdl with DefaultNodeShal... ....
 Check job cycle using jobs collection and jdl with DefaultNodeShallowRetryCount attribute - CREAM 

Check job cycle using jobs collection and jdl with DefaultNodeShal... | FAIL |
[u"Check job cycle using jobs collection and jdl with DefaultNodeShallowRetryCount attribute - CREAM : TimeOutError: 'Timeout reached while waiting the job https://emitestbed44.cnaf.infn.it:9000/sfnM8No599ClXlV4oV3NDA to finish'"]
------------------------------------------------------------------------------
Check job cycle using DAG job and jdl with AllowZippedISB attribute   ....
 Check job cycle using DAG job and jdl with AllowZippedISB attribute - CREAM 

Check job cycle using DAG job and jdl with AllowZippedISB attribute   | FAIL |
[u"Check job cycle using DAG job and jdl with AllowZippedISB attribute - CREAM : GeneralError: 'Message Archiving the ISB files not found'"]
------------------------------------------------------------------------------
Check job cycle using jobs collection and jdl with AllowZippedISB ... ....
 Check job cycle using jobs collection and jdl with AllowZippedISB attribute - CREAM 

Check job cycle using jobs collection and jdl with AllowZippedISB ... | FAIL |
[u"Check job cycle using jobs collection and jdl with AllowZippedISB attribute - CREAM : GeneralError: 'Message Archiving the ISB files not found'"]
------------------------------------------------------------------------------
Check job cycle using DAG job and jdl with UserTags attribute         ....
 Check job cycle using DAG job and jdl with UserTags attribute - CREAM 

Check job cycle using DAG job and jdl with UserTags attribute         | PASS |
------------------------------------------------------------------------------
Check job cycle using jobs collection and jdl with UserTags attribute ....
 Check job cycle using jobs collection and jdl with UserTags attribute - CREAM 

Check job cycle using jobs collection and jdl with UserTags attribute | PASS |
------------------------------------------------------------------------------
Check job cycle using DAG job and jdl with ExpiryTime attribute       ....
 Check job cycle using DAG job and jdl with ExpiryTime attribute - CREAM 

Check job cycle using DAG job and jdl with ExpiryTime attribute       | FAIL |
[u"Check job cycle using DAG job and jdl with ExpiryTime attribute - CREAM : TimeOutError: 'Timeout reached while waiting the job https://emitestbed44.cnaf.infn.it:9000/rtXXYE4819C6lNB9HrxdlQ to finish'"]
------------------------------------------------------------------------------
Check job cycle using jobs collection and jdl with ExpiryTime attr... ....
 Check job cycle using jobs collection and jdl with ExpiryTime attribute - CREAM 

Check job cycle using jobs collection and jdl with ExpiryTime attr... | PASS |
------------------------------------------------------------------------------
WMS-jdl-attributes-coumpound-jobs-cycle :: WMS Jdl Attributes Coum... | FAIL |
11 critical tests, 3 passed, 8 failed
11 tests total, 3 passed, 8 failed
==============================================================================
Output:  /home/capannini/certificazione/WMSTaskIGIRTC172/output.xml
Log:     /home/capannini/certificazione/WMSTaskIGIRTC172/log.html
Report:  /home/capannini/certificazione/WMSTaskIGIRTC172/report.html

Resubmission - SOME FAILURES

[capannini@emitestbed54 WMSTaskIGIRTC172]$ pybot ~/git/WMS-Test-Suite/robot_testsuites/wms_tests/testsuites/WMS-service/WMS-job-resubmit.html
==============================================================================
WMS-job-resubmit :: WMS Job Resubmit Test Suite                               
==============================================================================
Shallow Resubmission                                                  ....
 Shallow Resubmission - CREAM 

Shallow Resubmission                                                  | PASS |
------------------------------------------------------------------------------
Deep Resubmission                                                     ....
 Deep Resubmission - CREAM 

Deep Resubmission                                                     | FAIL |
[u'Deep Resubmission - CREAM : Job aborted fon an unexpected reason: hit job shallow retry count (0): hit job shallow retry count (0) != hit job retry count (2)']
------------------------------------------------------------------------------
WMS-job-resubmit :: WMS Job Resubmit Test Suite                       | FAIL |
2 critical tests, 1 passed, 1 failed
2 tests total, 1 passed, 1 failed
==============================================================================
Output:  /home/capannini/certificazione/WMSTaskIGIRTC172/output.xml
Log:     /home/capannini/certificazione/WMSTaskIGIRTC172/log.html
Report:  /home/capannini/certificazione/WMSTaskIGIRTC172/report.html

Limiter mechanism - FAILED

[capannini@emitestbed54 WMSTaskIGIRTC172]$ pybot ~/git/WMS-Test-Suite/robot_testsuites/wms_tests/testsuites/WMS-service/WMS-limiter-mechanism.html
==============================================================================
WMS-limiter-mechanism :: Test the WMS limiter mechanism operation             
==============================================================================
Test Option load1                                                     | FAIL |
Failure reason is not 'System load is too high' as expected: '
Connecting to the service https://emitestbed44.cnaf.infn.it:7443/glite_wms_wmproxy_server


Connection failed: CA certificate verification failed



Error - Operation failed
Unable to find any endpoint where to perform service request
' does not contain 'System load is too high'
------------------------------------------------------------------------------
Test Option load5                                                     | FAIL |
Failure reason is not 'System load is too high' as expected: '
Connecting to the service https://emitestbed44.cnaf.infn.it:7443/glite_wms_wmproxy_server


Connection failed: CA certificate verification failed



Error - Operation failed
Unable to find any endpoint where to perform service request
' does not contain 'System load is too high'
------------------------------------------------------------------------------
Test Option load15                                                    | FAIL |
Failure reason is not 'System load is too high' as expected: '
Connecting to the service https://emitestbed44.cnaf.infn.it:7443/glite_wms_wmproxy_server


Connection failed: CA certificate verification failed



Error - Operation failed
Unable to find any endpoint where to perform service request
' does not contain 'System load is too high'
------------------------------------------------------------------------------
Test Option memusage                                                  | FAIL |
Failure reason is not 'System load is too high' as expected: '
Connecting to the service https://emitestbed44.cnaf.infn.it:7443/glite_wms_wmproxy_server


Connection failed: CA certificate verification failed



Error - Operation failed
Unable to find any endpoint where to perform service request
' does not contain 'System load is too high'
------------------------------------------------------------------------------
Test Option swapusage                                                 | FAIL |
Failure reason is not 'System load is too high' as expected: '
Connecting to the service https://emitestbed44.cnaf.infn.it:7443/glite_wms_wmproxy_server


Connection failed: CA certificate verification failed



Error - Operation failed
Unable to find any endpoint where to perform service request
' does not contain 'System load is too high'
------------------------------------------------------------------------------
Test Option ftpconn                                                   | FAIL |
Failure reason is not 'System load is too high' as expected: '
Connecting to the service https://emitestbed44.cnaf.infn.it:7443/glite_wms_wmproxy_server


Connection failed: CA certificate verification failed



Error - Operation failed
Unable to find any endpoint where to perform service request
' does not contain 'System load is too high'
------------------------------------------------------------------------------
Test Option diskusage                                                 | FAIL |
Failure reason is not 'System load is too high' as expected: '
Connecting to the service https://emitestbed44.cnaf.infn.it:7443/glite_wms_wmproxy_server


Connection failed: CA certificate verification failed



Error - Operation failed
Unable to find any endpoint where to perform service request
' does not contain 'System load is too high'
------------------------------------------------------------------------------
Test Option fdnum                                                     | FAIL |
Failure reason is not 'System load is too high' as expected: '
Connecting to the service https://emitestbed44.cnaf.infn.it:7443/glite_wms_wmproxy_server


Connection failed: CA certificate verification failed



Error - Operation failed
Unable to find any endpoint where to perform service request
' does not contain 'System load is too high'
------------------------------------------------------------------------------
Test Option jdnum                                                     | FAIL |
Failure reason is not 'System load is too high' as expected: '
Connecting to the service https://emitestbed44.cnaf.infn.it:7443/glite_wms_wmproxy_server


Connection failed: CA certificate verification failed



Error - Operation failed
Unable to find any endpoint where to perform service request
' does not contain 'System load is too high'
------------------------------------------------------------------------------
Test Option jdsize                                                    | FAIL |
Failure reason is not 'System load is too high' as expected: '
Connecting to the service https://emitestbed44.cnaf.infn.it:7443/glite_wms_wmproxy_server


Connection failed: CA certificate verification failed



Error - Operation failed
Unable to find any endpoint where to perform service request
' does not contain 'System load is too high'
------------------------------------------------------------------------------
WMS-limiter-mechanism :: Test the WMS limiter mechanism operation     | FAIL |
10 critical tests, 0 passed, 10 failed
10 tests total, 0 passed, 10 failed
==============================================================================
Output:  /home/capannini/certificazione/WMSTaskIGIRTC172/output.xml
Log:     /home/capannini/certificazione/WMSTaskIGIRTC172/log.html
Report:  /home/capannini/certificazione/WMSTaskIGIRTC172/report.html

List match - PASSED

[capannini@emitestbed54 WMSTaskIGIRTC172]$ pybot ~/git/WMS-Test-Suite/robot_testsuites/wms_tests/testsuites/WMS-service/WMS-list-match.html
==============================================================================
WMS-list-match :: WMS list match testing suite.                               
==============================================================================
Check Executables                                                     | PASS |
------------------------------------------------------------------------------
Simple Matching                                                       | PASS |
------------------------------------------------------------------------------
Delegation Matching                                                   | PASS |
------------------------------------------------------------------------------
Exclude CE from Match                                                 | PASS |
------------------------------------------------------------------------------
Failure Matching                                                      | PASS |
------------------------------------------------------------------------------
Matching (EnableWMSFeedback True)                                     | PASS |
------------------------------------------------------------------------------
WMS-list-match :: WMS list match testing suite.                       | PASS |
6 critical tests, 6 passed, 0 failed
6 tests total, 6 passed, 0 failed
==============================================================================
Output:  /home/capannini/certificazione/WMSTaskIGIRTC172/output.xml
Log:     /home/capannini/certificazione/WMSTaskIGIRTC172/log.html
Report:  /home/capannini/certificazione/WMSTaskIGIRTC172/report.html

Prologue/epilogue - PASSED

[capannini@emitestbed54 WMSTaskIGIRTC172]$ pybot ~/git/WMS-Test-Suite/robot_testsuites/wms_tests/testsuites/WMS-service/WMS-prologue-epilogue.html
==============================================================================
WMS-prologue-epilogue :: WMS Prologue Epilogue Test Suite                     
==============================================================================
Prologue                                                              ....
 Prologue - CREAM 

Prologue                                                              | PASS |
------------------------------------------------------------------------------
Epilogue                                                              ....
 Epilogue - CREAM 

Epilogue                                                              | PASS |
------------------------------------------------------------------------------
Prologue and Epilogue                                                 ....
 Prologue and Epilogue - CREAM 

Prologue and Epilogue                                                 | PASS |
------------------------------------------------------------------------------
WMS-prologue-epilogue :: WMS Prologue Epilogue Test Suite             | PASS |
3 critical tests, 3 passed, 0 failed
3 tests total, 3 passed, 0 failed
==============================================================================
Output:  /home/capannini/certificazione/WMSTaskIGIRTC172/output.xml
Log:     /home/capannini/certificazione/WMSTaskIGIRTC172/log.html
Report:  /home/capannini/certificazione/WMSTaskIGIRTC172/report.html

Proxy renewal - SOME FAILURES

[capannini@emitestbed54 WMSTaskIGIRTC172]$ myproxy-init -s myproxy.cnaf.infn.it -d -n
Your identity: /C=IT/O=INFN/OU=Personal Certificate/L=CNAF/CN=Fabio Capannini
Enter GRID pass phrase for this identity:
Creating proxy ................................................................... Done
Proxy Verify OK
Your proxy is valid until: Thu Feb 20 15:18:42 2014
A proxy valid for 168 hours (7.0 days) for user /C=IT/O=INFN/OU=Personal Certificate/L=CNAF/CN=Fabio Capannini now exists on myproxy.cnaf.infn.it.

[root@emitestbed44 siteinfo]# rm -rf /var/ice/persist_dir/*
You have new mail in /var/spool/mail/root
[root@emitestbed44 siteinfo]# rm -f /var/glite/spool/glite-renewd/*
[root@emitestbed44 siteinfo]# /etc/init.d/glite-wms-ice restart
stopping ICE... ok
starting ICE... ok

[capannini@emitestbed54 WMSTaskIGIRTC172]$ pybot ~/git/WMS-Test-Suite/robot_testsuites/wms_tests/testsuites/WMS-service/WMS-proxy-renewal.html
==============================================================================
WMS-proxy-renewal :: WMS Proxy Renewal Test Suite                             
==============================================================================
Proxy renewal                                                         ....
 Proxy renewal - CREAM 

Proxy renewal                                                         | PASS |
------------------------------------------------------------------------------
Proxy renewal without setting MYPROXYSERVER                           ....
 Proxy renewal without setting MYPROXYSERVER - CREAM 

[ WARN ] Unexpected failed reason                                             
Proxy renewal without setting MYPROXYSERVER                           | FAIL |
[u"Proxy renewal without setting MYPROXYSERVER - CREAM : GeneralError: 'Unexpected failed reason'"]
------------------------------------------------------------------------------
WMS-proxy-renewal :: WMS Proxy Renewal Test Suite                     | FAIL |
2 critical tests, 1 passed, 1 failed
2 tests total, 1 passed, 1 failed
==============================================================================
Output:  /home/capannini/certificazione/WMSTaskIGIRTC172/output.xml
Log:     /home/capannini/certificazione/WMSTaskIGIRTC172/log.html
Report:  /home/capannini/certificazione/WMSTaskIGIRTC172/report.html

Purger - SOME FAILURES

[capannini@emitestbed54 WMSTaskIGIRTC172]$ pybot -e case1 -e case6 -e case7 ~/git/WMS-Test-Suite/robot_testsuites/wms_tests/testsuites/WMS-service/WMS-check-purger.html
==============================================================================
WMS-check-purger :: WMS Check Purger Test Suite                               
==============================================================================
Test purge , normal job cycle ( Submit to CREAM CE )                  | PASS |
------------------------------------------------------------------------------
Test proxy cache purging                                              | FAIL |
GeneralError: 'Test Failed. There are empty directories in %2FC%3DIT%2FO%3DINFN%2FOU%3DPersonal%20Certificate%2FL%3DCNAF%2FCN%3DFabio%20Capannini'
------------------------------------------------------------------------------
SandBoxDir cron purger ( Submit a job and force its purge before i... | PASS |
------------------------------------------------------------------------------
SandBoxDir cron purger ( Purge a DONE job )                           | PASS |
------------------------------------------------------------------------------
SandBoxDir cron purger ( Purge a DAG job )                            | PASS |
------------------------------------------------------------------------------
WMS-check-purger :: WMS Check Purger Test Suite                       | FAIL |
5 critical tests, 4 passed, 1 failed
5 tests total, 4 passed, 1 failed
==============================================================================
Output:  /home/capannini/certificazione/WMSTaskIGIRTC172/output.xml
Log:     /home/capannini/certificazione/WMSTaskIGIRTC172/log.html
Report:  /home/capannini/certificazione/WMSTaskIGIRTC172/report.html

Configuration - SOME FAILURES

[capannini@emitestbed54 WMSTaskIGIRTC172]$ pybot ~/git/WMS-Test-Suite/robot_testsuites/wms_tests/testsuites/WMS-service/WMS-check-configuration-3.4.html
==============================================================================
WMS-check-configuration-3.4 :: Check the syntax of the WMS configuration fi...
==============================================================================
Check Common Section                                                  | PASS |
------------------------------------------------------------------------------
Check JobController Section                                           | PASS |
------------------------------------------------------------------------------
Check NetworkServer Section                                           | PASS |
------------------------------------------------------------------------------
Check LogMonitor Section                                              | PASS |
------------------------------------------------------------------------------
Check WorkloadManager Section                                         | FAIL |
GeneralError: u'Section: WorkloadManager , problem with following attributes: set([\'IsmThreads  =  true;\', \'IsmIiLDAPCEFilterExt  =  "(|(GlueCEAccessControlBaseRule=VO:testers.eu-emi.eu)(GlueCEAccessControlBaseRule=VOMS:/testers.eu-emi.eu/*)(GlueCEAccessControlBaseRule=VO:testers2.eu-emi.eu)(GlueCEAccessControlBaseRule=VOMS:/testers2.eu-emi.eu/*)(GlueCEAccessControlBaseRule=VO:testers3.eu-emi.eu)(GlueCEAccessControlBaseRule=VOMS:/testers3.eu-emi.eu/*)(GlueCEAccessControlBaseRule=VO:dteam)(GlueCEAccessControlBaseRule=VOMS:/dteam/*)(GlueCEAccessControlBaseRule=VO:infngrid)(GlueCEAccessControlBaseRule=VOMS:/infngrid/*))";\', \'IsmThreads  =  false;\', \'IsmIiLDAPCEFilterExt  =  "(|(GlueCEAccessControlBaseRule=VO:testers.eu-emi.eu)(GlueCEAccessControlBaseRule=VOMS:/testers.eu-emi.eu/*)(GlueCEAccessControlBaseRule=VO:testers2.eu-emi.eu)(GlueCEAccessControlBaseRule=VOMS:/testers2.eu-emi.eu/*)(GlueCEAccessControlBaseRule=VO:cms)(GlueCEAccessControlBaseRule=VOMS:/cms/*)(GlueCEAccessControlBaseRule=VO:dteam)(GlueCEAccessControlBaseRule=VOMS:/dteam/*)(GlueCEAccessControlBaseRule=VO:infngrid)(GlueCEAccessControlBaseRule=VOMS:/infngrid/*))";\'])'
------------------------------------------------------------------------------
Check WorkloadManagerProxy Section                                    | FAIL |
GeneralError: u'Section: WorkloadManagerProxy , problem with following attributes: set([\'AsyncJobStart  =  true;\', \'AsyncJobStart  =  false;\', \'Wms_Pepc_ResourceId  =  "https://emitestbed44.cnaf.infn.it:7443/glite_wms_wmproxy_server";\'])'
------------------------------------------------------------------------------
Check ICE Section                                                     | FAIL |
GeneralError: u"Section: ICE , problem with following attributes: set(['proxy_renewal_timeout  =  120;', 'ice_log_level   =   500;', 'ice_log_level   =   300;'])"
------------------------------------------------------------------------------
Check Variables                                                       | FAIL |
This test requires the YAIM_FILE configuration file. Please set the YAIM_FILE variable in the test's configuration file.
------------------------------------------------------------------------------
WMS-check-configuration-3.4 :: Check the syntax of the WMS configu... | FAIL |
8 critical tests, 4 passed, 4 failed
8 tests total, 4 passed, 4 failed
==============================================================================
Output:  /home/capannini/certificazione/WMSTaskIGIRTC172/output.xml
Log:     /home/capannini/certificazione/WMSTaskIGIRTC172/log.html
Report:  /home/capannini/certificazione/WMSTaskIGIRTC172/report.html

Delegation - SOME FAILURES

[capannini@emitestbed54 WMSTaskIGIRTC172]$ pybot ~/git/WMS-Test-Suite/robot_testsuites/wms_tests/testsuites/WMS-service/WMS-delegation.html
==============================================================================
WMS-delegation :: WMS Delegation Test Suite                                   
==============================================================================
Check --autm-delegation option                                        | PASS |
------------------------------------------------------------------------------
Check --delegationid option                                           | PASS |
------------------------------------------------------------------------------
Try to delegate with a short proxy                                    | PASS |
------------------------------------------------------------------------------
Works with expired proxy                                              | FAIL |
RunCommandError: u'Command glite-wms-job-info --config /home/capannini/certificazione/WMSTaskIGIRTC172/WMSService-WMS-delegation_20140213162739/wms.conf -d deleg-1392305272 failed. Failure message: \nConnecting to the service https://emitestbed44.cnaf.infn.it:7443/glite_wms_wmproxy_server\n\n\nError - WMProxy Server Error\nProxy exception: the proxy has expired\nError code: SOAP-ENV:Server\n\n'
------------------------------------------------------------------------------
Works with long chain proxies (ggus ticket 79096)                     | FAIL |
GeneralError: 'Failed to create a valid user proxy'
------------------------------------------------------------------------------
WMS-delegation :: WMS Delegation Test Suite                           | FAIL |
5 critical tests, 3 passed, 2 failed
5 tests total, 3 passed, 2 failed
==============================================================================
Output:  /home/capannini/certificazione/WMSTaskIGIRTC172/output.xml
Log:     /home/capannini/certificazione/WMSTaskIGIRTC172/log.html
Report:  /home/capannini/certificazione/WMSTaskIGIRTC172/report.html

Feedback - PASSED

The parameter EnableReplanner has been introduced but is not configured by yaim so it must be manually defined in glite_wms.conf (WorkloadManager section) before
running the test. If it is not set, the test fails as expected as the default is false; it must be set to true for this test to be run successfully.
[capannini@emitestbed54 WMSTaskIGIRTC172]$ pybot ~/git/WMS-Test-Suite/robot_testsuites/wms_tests/testsuites/WMS-service/WMS-feedback-test.html
==============================================================================
WMS-feedback-test :: Test the WMS limiter mechanism operation                 
==============================================================================
Test WMS feedback feature                                             | PASS |
------------------------------------------------------------------------------
WMS-feedback-test :: Test the WMS limiter mechanism operation         | PASS |
1 critical test, 1 passed, 0 failed
1 test total, 1 passed, 0 failed
==============================================================================
Output:  /home/capannini/certificazione/WMSTaskIGIRTC172/output.xml
Log:     /home/capannini/certificazione/WMSTaskIGIRTC172/log.html
Report:  /home/capannini/certificazione/WMSTaskIGIRTC172/report.html

 
META FILEATTACHMENT attachment="submit.tgz" attr="" comment="" date="1392216782" name="submit.tgz" path="submit.tgz" size="187449" user="FabioCapannini" version="1"
META FILEATTACHMENT attachment="jdl.tgz" attr="" comment="" date="1392284918" name="jdl.tgz" path="jdl.tgz" size="175771" user="FabioCapannini" version="1"
META FILEATTACHMENT attachment="WMSService-WMS-jdl-attributes-job-cycle_20140212155356.log" attr="" comment="" date="1392285150" name="WMSService-WMS-jdl-attributes-job-cycle_20140212155356.log" path="WMSService-WMS-jdl-attributes-job-cycle_20140212155356.log" size="239481" user="FabioCapannini" version="1"
META FILEATTACHMENT attachment="WMSService-WMS-job-cycle_20140212102956.log" attr="" comment="" date="1392285164" name="WMSService-WMS-job-cycle_20140212102956.log" path="WMSService-WMS-job-cycle_20140212102956.log" size="665381" user="FabioCapannini" version="1"
Added:
>
>
META FILEATTACHMENT attachment="compound.tgz" attr="" comment="" date="1392299464" name="compound.tgz" path="compound.tgz" size="220168" user="FabioCapannini" version="1"
META FILEATTACHMENT attachment="resubmit.tgz" attr="" comment="" date="1392300188" name="resubmit.tgz" path="resubmit.tgz" size="127182" user="FabioCapannini" version="1"
META FILEATTACHMENT attachment="limiter.tgz" attr="" comment="" date="1392300416" name="limiter.tgz" path="limiter.tgz" size="137003" user="FabioCapannini" version="1"
META FILEATTACHMENT attachment="listmatch.tgz" attr="" comment="" date="1392300563" name="listmatch.tgz" path="listmatch.tgz" size="121486" user="FabioCapannini" version="1"
META FILEATTACHMENT attachment="prolog.tgz" attr="" comment="" date="1392301046" name="prolog.tgz" path="prolog.tgz" size="129610" user="FabioCapannini" version="1"
META FILEATTACHMENT attachment="renew.tgz" attr="" comment="" date="1392304350" name="renew.tgz" path="renew.tgz" size="136612" user="FabioCapannini" version="1"
META FILEATTACHMENT attachment="purger.tgz" attr="" comment="" date="1392305059" name="purger.tgz" path="purger.tgz" size="139941" user="FabioCapannini" version="1"
META FILEATTACHMENT attachment="conf.tgz" attr="" comment="" date="1392305238" name="conf.tgz" path="conf.tgz" size="119412" user="FabioCapannini" version="1"
META FILEATTACHMENT attachment="deleg.tgz" attr="" comment="" date="1392305512" name="deleg.tgz" path="deleg.tgz" size="128060" user="FabioCapannini" version="1"
META FILEATTACHMENT attachment="feedback.tgz" attr="" comment="" date="1392308755" name="feedback.tgz" path="feedback.tgz" size="130196" user="FabioCapannini" version="1"
 
This site is powered by the TWiki collaboration platformCopyright © 2008-2019 by the contributing authors. All material on this collaboration platform is the property of the contributing authors.
Ideas, requests, problems regarding TWiki? Send feedback