Difference: WMSTaskIGIRTC172 (4 vs. 5)

Revision 52014-02-14 - FabioCapannini

Line: 1 to 1
 

WMS 3.6.3 test report - IGIRTC-172

Line: 512 to 512
 

Changed:
<
<

Proxy renewal - SOME FAILURES

>
>

Proxy renewal - PASSED

 
[capannini@emitestbed54 WMSTaskIGIRTC172]$ myproxy-init -s myproxy.cnaf.infn.it -d -n
Your identity: /C=IT/O=INFN/OU=Personal Certificate/L=CNAF/CN=Fabio Capannini
Line: 541 to 541
 Proxy renewal without setting MYPROXYSERVER .... Proxy renewal without setting MYPROXYSERVER - CREAM
Changed:
<
<
[ WARN ] Unexpected failed reason Proxy renewal without setting MYPROXYSERVER | FAIL | [u"Proxy renewal without setting MYPROXYSERVER - CREAM : GeneralError: 'Unexpected failed reason'"]
>
>
Proxy renewal without setting MYPROXYSERVER | PASS |
 
Changed:
<
<
WMS-proxy-renewal :: WMS Proxy Renewal Test Suite | FAIL | 2 critical tests, 1 passed, 1 failed 2 tests total, 1 passed, 1 failed
>
>
WMS-proxy-renewal :: WMS Proxy Renewal Test Suite | PASS | 2 critical tests, 2 passed, 0 failed 2 tests total, 2 passed, 0 failed
 ========================================================================== Output: /home/capannini/certificazione/WMSTaskIGIRTC172/output.xml Log: /home/capannini/certificazione/WMSTaskIGIRTC172/log.html
Line: 553 to 551
 Log: /home/capannini/certificazione/WMSTaskIGIRTC172/log.html Report: /home/capannini/certificazione/WMSTaskIGIRTC172/report.html
Added:
>
>
 
Changed:
<
<

Purger - SOME FAILURES

>
>

Purger - PASSED

 
[capannini@emitestbed54 WMSTaskIGIRTC172]$ pybot -e case1 -e case6 -e case7 ~/git/WMS-Test-Suite/robot_testsuites/wms_tests/testsuites/WMS-service/WMS-check-purger.html
==============================================================================
Line: 580 to 579
 Output: /home/capannini/certificazione/WMSTaskIGIRTC172/output.xml Log: /home/capannini/certificazione/WMSTaskIGIRTC172/log.html Report: /home/capannini/certificazione/WMSTaskIGIRTC172/report.html
Added:
>
>
[capannini@emitestbed54 WMSTaskIGIRTC172]$ pybot -i case3 ~/git/WMS-Test-Suite/robot_testsuites/wms_tests/testsuites/WMS-service/WMS-check-purger.html ========================================================================== WMS-check-purger :: WMS Check Purger Test Suite ========================================================================== Test proxy cache purging | PASS |
WMS-check-purger :: WMS Check Purger Test Suite | PASS | 1 critical test, 1 passed, 0 failed 1 test total, 1 passed, 0 failed ========================================================================== Output: /home/capannini/certificazione/WMSTaskIGIRTC172/output.xml Log: /home/capannini/certificazione/WMSTaskIGIRTC172/log.html Report: /home/capannini/certificazione/WMSTaskIGIRTC172/report.html
 

Added:
>
>
 

Configuration - SOME FAILURES

[capannini@emitestbed54 WMSTaskIGIRTC172]$ pybot ~/git/WMS-Test-Suite/robot_testsuites/wms_tests/testsuites/WMS-service/WMS-check-configuration-3.4.html
Line: 667 to 682
 

Added:
>
>

Job cancel - SOME FAILURES

[capannini@emitestbed54 WMSTaskIGIRTC172]$ pybot ~/git/WMS-Test-Suite/robot_testsuites/wms_tests/testsuites/WMS-service/WMS-job-cancel.html
==============================================================================
WMS-job-cancel :: WMS Job Cancel Test Suite                                   
==============================================================================
Cancel Normal Job                                                     | PASS |
------------------------------------------------------------------------------
Cancel DAG Job                                                        | PASS |
------------------------------------------------------------------------------
Cancel one node of a DAG Job                                          | FAIL |
GeneralError: 'Job status is wrong: Aborted'
------------------------------------------------------------------------------
Cancel job collection                                                 | FAIL |
GeneralError: 'Job status is wrong: Cleared'
------------------------------------------------------------------------------
Cancel one node of a job collection                                   | FAIL |
GeneralError: 'Job status is wrong: Cleared'
------------------------------------------------------------------------------
Cancel parametric job                                                 | FAIL |
GeneralError: 'Job status is wrong: Done(Success)'
------------------------------------------------------------------------------
Cancel one node of a parametric job                                   | FAIL |
GeneralError: 'Job status is wrong: Running'
------------------------------------------------------------------------------
Cancel MPI job                                                        | FAIL |
RunCommandError: 'Command glite-wms-job-cancel failed. Check log file for details'
------------------------------------------------------------------------------
Cancel a DONE OK job                                                  | PASS |
------------------------------------------------------------------------------
WMS-job-cancel :: WMS Job Cancel Test Suite                           | FAIL |
9 critical tests, 3 passed, 6 failed
9 tests total, 3 passed, 6 failed
==============================================================================
Output:  /home/capannini/certificazione/WMSTaskIGIRTC172/output.xml
Log:     /home/capannini/certificazione/WMSTaskIGIRTC172/log.html
Report:  /home/capannini/certificazione/WMSTaskIGIRTC172/report.html

Various tests - SOME FAILURES

[capannini@emitestbed54 WMSTaskIGIRTC172]$ pybot ~/git/WMS-Test-Suite/robot_testsuites/wms_tests/testsuites/WMS-service/WMS-various-tests.html
==============================================================================
WMS-various-tests :: WMS Various Tests Test Suite                             
==============================================================================
Test OSB truncation                                                   ........
 Test OSB truncation - CREAM 

Test OSB truncation                                                   | FAIL |
[u"Test OSB truncation - CREAM : Not found message 'OSB quota exceeded for' at UserTag: '\n===================== glite-wms-job-logging-info Success =====================\n\nLOGGING INFORMATION:\n\nPrinting info for the Job : https://emitestbed44.cnaf.infn.it:9000/gPFKGRTqzOjUURu-HnA66w\n \n\t---\nEvent: UserTag\n- Arrived                    =    Fri Feb 14 16:23:26 2014 CET\n- Host                       =    emitestbed44.cnaf.infn.it\n- Level                      =    SYSTEM\n- Name                       =    CEInfoHostName\n- Priority                   =    synchronous\n- Seqcode                    =    UI=000000:NS=0000000004:WM=000003:BH=0000000000:JSS=000000:LM=000000:LRMS=000000:APP=000000:LBS=000000\n- Source                     =    WorkloadManager\n- Src instance               =    19607\n- Timestamp                  =    Fri Feb 14 16:23:26 2014 CET\n- User                       =    /C=IT/O=INFN/OU=Personal Certificate/L=CNAF/CN=Fabio Capannini/CN=proxy/CN=proxy\n- Value                      =    cert-34.pd.infn.it\n==========================================================================\n' does not contain 'OSB quota exceeded for'"]
------------------------------------------------------------------------------
Test drain operation                                                  | PASS |
------------------------------------------------------------------------------
Test usage of grid_monitor.sh script                                  | FAIL |
GeneralError: 'Unable to find script /opt/lcg/sbin/grid_monitor.sh'
------------------------------------------------------------------------------
WMS-various-tests :: WMS Various Tests Test Suite                     | FAIL |
3 critical tests, 1 passed, 2 failed
3 tests total, 1 passed, 2 failed
==============================================================================
Output:  /home/capannini/certificazione/WMSTaskIGIRTC172/output.xml
Log:     /home/capannini/certificazione/WMSTaskIGIRTC172/log.html
Report:  /home/capannini/certificazione/WMSTaskIGIRTC172/report.html

 
META FILEATTACHMENT attachment="submit.tgz" attr="" comment="" date="1392216782" name="submit.tgz" path="submit.tgz" size="187449" user="FabioCapannini" version="1"
META FILEATTACHMENT attachment="jdl.tgz" attr="" comment="" date="1392284918" name="jdl.tgz" path="jdl.tgz" size="175771" user="FabioCapannini" version="1"
Line: 682 to 764
 
META FILEATTACHMENT attachment="conf.tgz" attr="" comment="" date="1392305238" name="conf.tgz" path="conf.tgz" size="119412" user="FabioCapannini" version="1"
META FILEATTACHMENT attachment="deleg.tgz" attr="" comment="" date="1392305512" name="deleg.tgz" path="deleg.tgz" size="128060" user="FabioCapannini" version="1"
META FILEATTACHMENT attachment="feedback.tgz" attr="" comment="" date="1392308755" name="feedback.tgz" path="feedback.tgz" size="130196" user="FabioCapannini" version="1"
Added:
>
>
META FILEATTACHMENT attachment="renewal.tgz" attr="" comment="" date="1392387430" name="renewal.tgz" path="renewal.tgz" size="135484" user="FabioCapannini" version="1"
META FILEATTACHMENT attachment="purger3.tgz" attr="" comment="" date="1392387848" name="purger3.tgz" path="purger3.tgz" size="117707" user="FabioCapannini" version="1"
META FILEATTACHMENT attachment="cancel.tgz" attr="" comment="" date="1392391365" name="cancel.tgz" path="cancel.tgz" size="145327" user="FabioCapannini" version="1"
META FILEATTACHMENT attachment="various.tgz" attr="" comment="" date="1392392035" name="various.tgz" path="various.tgz" size="135496" user="FabioCapannini" version="1"
 
This site is powered by the TWiki collaboration platformCopyright © 2008-2019 by the contributing authors. All material on this collaboration platform is the property of the contributing authors.
Ideas, requests, problems regarding TWiki? Send feedback