Tags:
, view all tags

Testing and Certification report savannah task #21059 CREAM v. 1.14.0 (EMI2)

Summary

  • Product: CREAM v. 1.14.0
  • Release Task: Task #21059
  • ETICS Subsystem Configuration Name: emi-cream-ce_R_1_14_0_3
  • VCS Tag: emi-cream-mp_R_1_1_0_3
  • EMI Major Release: EMI 2 (Matterhorn)
  • Platform: SL5 epel
  • Author: Sara Bertocco
  • Testing report: TBD
  • Certification report: TBD
  • Date: 12st April 2012
  • Outcome: In certification

SL5

Deployment tests

Clean Installation

  • EMI2 CREAM SL5 installation from scratch and configuration log here.

  • EMI2 CREAM SL6 installation from scratch and configuration log here.

Upgrade Installation

  • EMI2 CREAM SL5 update from EMI1 production version and configuration log here.

Unit Tests

TODO: ask mbuto

System tests

Functionality tests after the update

In SL5 installed from scratch:


[root@cream-48 ~]# service gLite restart
STOPPING SERVICES
*** glite-lb-locallogger:
Stopping glite-lb-logd ... not running
Stopping glite-lb-interlogd ... not running

*** tomcat5:
Stopping tomcat5:                                          [  OK  ]

*** glite-ce-blah-parser:
Shutting down BNotifier:                                   [  OK  ]
Shutting down BUpdaterLSF:                                 [  OK  ]

STARTING SERVICES
*** glite-ce-blah-parser:
Starting BNotifier:                                        [  OK  ]
Starting BUpdaterLSF:                                      [  OK  ]

*** tomcat5:
Starting tomcat5:                                          [  OK  ]

*** glite-lb-locallogger:
Error: GLITE_USER is not set
FAILED

In SL5 update from EMI1 production to EMI2:

service gLite restart
STOPPING SERVICES
*** tomcat5:
Stopping tomcat5:                                          [  OK  ]

*** glite-ce-blah-parser:
Shutting down BNotifier:                                   [  OK  ]
Shutting down BUpdaterLSF:                                 [  OK  ]

*** glite-ce-blahparser:
/etc/init.d/gLite: line 48: /etc/init.d/glite-ce-blahparser: No such file or directory

*** glite-lb-locallogger:
Stopping glite-lb-logd ... done
Stopping glite-lb-interlogd ... done

*** tomcat5:
Stopping tomcat5:
STARTING SERVICES
*** tomcat5:
Starting tomcat5:                                          [  OK  ]

*** glite-lb-locallogger:
Starting glite-lb-logd ...This is LocalLogger, part of Workload Management System in EU DataGrid & EGEE.
 done
Starting glite-lb-interlogd ... done

*** glite-ce-blahparser:
/etc/init.d/gLite: line 40: /etc/init.d/glite-ce-blahparser: No such file or directory

*** glite-ce-blah-parser:
Starting BNotifier: /usr/libexec/BNotifier: Error creating and binding socket: Address already in use
                                                           [FAILED]
Starting BUpdaterLSF:                                      [  OK  ]

*** tomcat5:
Starting tomcat5: tomcat5 process already running

Regression tests

Tests of attached bugs fixed in CREAM 1.14

Regression tests of bugs fixed in CREAM 1.13.3

  • bug_81561 FIXED
$ JobDBAdminPurger.sh -c /etc/glite-ce-cream/cream-config.xml  -s DONE-FAILED,0
log4j:WARN No appenders could be found for logger (org.glite.ce.commonj.configuration.xppm.ConfigurationManager).
log4j:WARN Please initialize the log4j system properly.
AbandonedObjectPool is used (org.apache.commons.dbcp.AbandonedObjectPool@5c73a7ab)
   LogAbandoned: false
   RemoveAbandoned: true
   RemoveAbandonedTimeout: 30
START jobAdminPurger
-----------------------------------------------------------
Job CREAM615605246 is going to be purged ...
CREAM615605246 has been purged!
-----------------------------------------------------------

-----------------------------------------------------------
Job CREAM208116849 is going to be purged ...
CREAM208116849 has been purged!
-----------------------------------------------------------

-----------------------------------------------------------
Job CREAM415420889 is going to be purged ...
CREAM415420889 has been purged!
-----------------------------------------------------------

-----------------------------------------------------------
Job CREAM244215198 is going to be purged ...
CREAM244215198 has been purged!
-----------------------------------------------------------

-----------------------------------------------------------
Job CREAM677106743 is going to be purged ...
CREAM677106743 has been purged!
-----------------------------------------------------------

-----------------------------------------------------------
Job CREAM999977070 is going to be purged ...
CREAM999977070 has been purged!
-----------------------------------------------------------

-----------------------------------------------------------
Job CREAM029821674 is going to be purged ...
CREAM029821674 has been purged!
-----------------------------------------------------------

-----------------------------------------------------------
Job CREAM209002030 is going to be purged ...
CREAM209002030 has been purged!
-----------------------------------------------------------

-----------------------------------------------------------
Job CREAM301874724 is going to be purged ...
CREAM301874724 has been purged!
-----------------------------------------------------------

STOP jobAdminPurger

  • bug_83238 FIXED
==============================================================================
Bug 83238 :: Regression test of bug #83238 Sometimes CREAM does not update ...
==============================================================================
Set Log Level :: Set the log level used for the test suite. This c... | PASS |
------------------------------------------------------------------------------
Check Executables :: Check whether the needed executables for the ... | PASS |
------------------------------------------------------------------------------
bug_83238                                                             | PASS |
------------------------------------------------------------------------------
Bug 83238 :: Regression test of bug #83238 Sometimes CREAM does no... | PASS |
3 critical tests, 3 passed, 0 failed
3 tests total, 3 passed, 0 failed
==============================================================================

  • bug_83749 FIXED
[bertocco@cream-12 tests]$ glite-ce-job-submit  -r cream-48.pd.infn.it:8443/cream-lsf-cert  -a /home/bertocco/jdl/bug87492.jdl
https://cream-48.pd.infn.it:8443/CREAM403470689
[bertocco@cream-12 tests]$ glite-ce-job-submit  -r cream-48.pd.infn.it:8443/cream-lsf-cert  -a /home/bertocco/jdl/bug87492.jdl
https://cream-48.pd.infn.it:8443/CREAM069317193
[bertocco@cream-12 tests]$ glite-ce-job-submit  -r cream-48.pd.infn.it:8443/cream-lsf-cert  -a /home/bertocco/jdl/simple_greci.jdl 
2012-04-30 19:56:56,352 WARN - VirtualOrganisation specified in the JDL but overrided with [dteam]
https://cream-48.pd.infn.it:8443/CREAM564301640

[bertocco@cream-12 tests]$ glite-ce-job-status https://cream-48.pd.infn.it:8443/CREAM403470689 https://cream-48.pd.infn.it:8443/CREAM069317193 https://cream-48.pd.infn.it:8443/CREAM564301640

******  JobID=[https://cream-48.pd.infn.it:8443/CREAM069317193]
   Status        = [DONE-OK]
   ExitCode      = [0]



******  JobID=[https://cream-48.pd.infn.it:8443/CREAM403470689]
   Status        = [DONE-OK]
   ExitCode      = [0]



******  JobID=[https://cream-48.pd.infn.it:8443/CREAM564301640]
   Status        = [DONE-OK]
   ExitCode      = [0]

Changed CREAM_SANDBOX_PATH and re-configured the cream ce, launched:

Job correctly purged:

[root@cream-48 ~]# JobDBAdminPurger.sh -c /etc/glite-ce-cream/cream-config.xml  -j CREAM069317193:CREAM403470689:CREAM564301640log4j:WARN No appenders could be found for logger (org.glite.ce.commonj.configuration.xppm.ConfigurationManager).
log4j:WARN Please initialize the log4j system properly.
AbandonedObjectPool is used (org.apache.commons.dbcp.AbandonedObjectPool@2d04faf8)
   LogAbandoned: false
   RemoveAbandoned: true
   RemoveAbandonedTimeout: 30
START jobAdminPurger
-----------------------------------------------------------
Job CREAM069317193 is going to be purged ...
CREAM069317193 has been purged!
-----------------------------------------------------------

-----------------------------------------------------------
Job CREAM403470689 is going to be purged ...
CREAM403470689 has been purged!
-----------------------------------------------------------

-----------------------------------------------------------
Job CREAM564301640 is going to be purged ...
CREAM564301640 has been purged!
-----------------------------------------------------------

STOP jobAdminPurger

[bertocco@cream-12 tests]$ glite-ce-job-status https://cream-48.pd.infn.it:8443/CREAM403470689 https://cream-48.pd.infn.it:8443/CREAM069317193 https://cream-48.pd.infn.it:8443/CREAM564301640

******  JobID=[https://cream-48.pd.infn.it:8443/CREAM069317193]
   For this job CREAM has returned a fault: MethodName=[jobStatus] Timestamp=[Mon 30 Apr 2012 20:04:53] ErrorCode=[2] Description=[job not found] FaultCause=[N/A]



******  JobID=[https://cream-48.pd.infn.it:8443/CREAM403470689]
   For this job CREAM has returned a fault: MethodName=[jobStatus] Timestamp=[Mon 30 Apr 2012 20:04:53] ErrorCode=[2] Description=[job not found] FaultCause=[N/A]



******  JobID=[https://cream-48.pd.infn.it:8443/CREAM564301640]
   For this job CREAM has returned a fault: MethodName=[jobStatus] Timestamp=[Mon 30 Apr 2012 20:04:53] ErrorCode=[2] Description=[job not found] FaultCause=[N/A]

Cleaned correctly also sandbox:

[root@cream-48 ~]# grep -r CREAM564301640 /var/cream_sandbox/dteam/
[root@cream-48 ~]# grep -r CREAM403470689 /var/cream_sandbox/dteam/
[root@cream-48 ~]# grep -r CREAM564301640 /var/cream_sandbox/dteam/

  • bug_84374 FIXED
==============================================================================
Bug 84374 :: Regression test of Bug #84374 yaim-cream-ce: GlueForeignKey: G...
==============================================================================
Set Log Level :: Set the log level used for the test suite. This c... | PASS |
------------------------------------------------------------------------------
bug_84374                                                             | PASS |
------------------------------------------------------------------------------
Bug 84374 :: Regression test of Bug #84374 yaim-cream-ce: GlueFore... | PASS |
2 critical tests, 2 passed, 0 failed
2 tests total, 2 passed, 0 failed
==============================================================================

  • bug_86191 FIXED
==============================================================================
Bug 86191 :: Regression test of Bug #86191 No info published by the lcg-inf...
==============================================================================
Set Log Level :: Set the log level used for the test suite. This c... | PASS |
------------------------------------------------------------------------------
bug_86191                                                             | PASS |
------------------------------------------------------------------------------
Bug 86191 :: Regression test of Bug #86191 No info published by th... | PASS |
2 critical tests, 2 passed, 0 failed
2 tests total, 2 passed, 0 failed
==============================================================================

  • bug_87492 FIXED
==============================================================================
Bug 87492 :: Regression test of bug #87492 CREAM doesn't handle correctly t...
==============================================================================
Set Log Level :: Set the log level used for the test suite. This c... | PASS |
------------------------------------------------------------------------------
bug_87492                                                             | PASS |
------------------------------------------------------------------------------
Bug 87492 :: Regression test of bug #87492 CREAM doesn't handle co... | PASS |
2 critical tests, 2 passed, 0 failed
2 tests total, 2 passed, 0 failed
==============================================================================

-- SaraBertocco - 2012-04-27

Topic attachments
I Attachment Action Size Date Who Comment
Unknown file formatlog EMI1_CREAMprod_to_EMI2RC_update.log manage 59.2 K 2012-04-27 - 11:31 SaraBertocco  
Unknown file formatlog EMI2RC_CREAM_SL5_install.log manage 122.4 K 2012-04-27 - 12:22 SaraBertocco  
Unknown file formatlog EMI2RC_CREAM_SL6_install.log manage 203.9 K 2012-04-27 - 11:59 SaraBertocco  
Edit | Attach | PDF | History: r29 | r5 < r4 < r3 < r2 | Backlinks | Raw View | More topic actions...
Topic revision: r3 - 2012-04-30 - SaraBertocco
 
  • Edit
  • Attach
This site is powered by the TWiki collaboration platformCopyright © 2008-2019 by the contributing authors. All material on this collaboration platform is the property of the contributing authors.
Ideas, requests, problems regarding TWiki? Send feedback