Tags:
, view all tags

CREAM v. 1.14.5 - Testing report SL5: IGIRTC-157

Summary

  • Product: CREAM v. 1.14.5
  • Release Task: IGIRTC-157
  • ETICS Subsystem Configuration Name:
  • VCS Tag:
  • EMI Major Release: EMI 2 (Matterhorn)
  • Platform: SL5 epel
  • Author: Sergio Traldi
  • Testing report: [[][Testing Report file]]
  • Certification report: [[][Certification Report file]]
  • Outcome: "Certified*

Deployment tests

Clean Installation

CREAM PBS

CREAM LSF

Upgrade Installation

CREAM PBS

CREAM LSF

Unit Tests

System tests

Functionality tests

CREAM PBS


  • Functionality testsuite log

CREAM LSF


  • Functionality testsuite log

Regression tests

Bug #CREAM-111 Wrong tokenization for epilogue argument list FIXED

Bug #CREAM-101 Wrong time format for MaxWallClockTime FIXED

From UI:

[traldi@cert-16 ~]$ ldapsearch -x -H ldap://cert-34.pd.infn.it:2170 -b o=grid | grep GlueCEPolicyMaxWallClockTime
GlueCEPolicyMaxWallClockTime: 4320
GlueCEPolicyMaxWallClockTime: 4320
GlueCEPolicyMaxWallClockTime: 4320

[traldi@cert-16 ~]$ ldapsearch -x -H ldap://cert-34.pd.infn.it:2170 -b o=grid | grep GlueCEPolicyMaxObtainableWallClockTime
GlueCEPolicyMaxObtainableWallClockTime: 4320
GlueCEPolicyMaxObtainableWallClockTime: 4320
GlueCEPolicyMaxObtainableWallClockTime: 4320

[traldi@cert-16 ~]$ ldapsearch -x -H ldap://cert-34.pd.infn.it:2170 -b o=glue | grep GLUE2ComputingShareDefaultWallTime
GLUE2ComputingShareDefaultWallTime: 259200
GLUE2ComputingShareDefaultWallTime: 259200
GLUE2ComputingShareDefaultWallTime: 259200
GLUE2ComputingShareDefaultWallTime: 259200
GLUE2ComputingShareDefaultWallTime: 259200
GLUE2ComputingShareDefaultWallTime: 259200
GLUE2ComputingShareDefaultWallTime: 259200

[traldi@cert-16 ~]$ ldapsearch -x -H ldap://cert-34.pd.infn.it:2170 -b o=glue | grep GLUE2ComputingShareMaxWallTime
GLUE2ComputingShareMaxWallTime: 259200
GLUE2ComputingShareMaxWallTime: 259200
GLUE2ComputingShareMaxWallTime: 259200
GLUE2ComputingShareMaxWallTime: 259200
GLUE2ComputingShareMaxWallTime: 259200
GLUE2ComputingShareMaxWallTime: 259200
GLUE2ComputingShareMaxWallTime: 259200

From CE:

[root@cert-34 ~]# qmgr -c 'list queue cert' | grep walltime
        resources_max.walltime = 72:00:00

Bug #CREAM-99 Python error on ERT calculation: local variable 'est' referenced before assignment FIXED

Bug #CREAM-84 The DelegationPurger may cause a java.lang.OutOfMemoryError exception FIXED

Bug #CREAM-83 CREAM should be able to immediately kill also queued jobs, when the proxy is expiring FIXED
Bug #CREAM-82 Check permission for /var/cream_sandbox FIXED
Bug #CREAM-78 Check for /etc/lrms in config_cream_gip_scheduler_plugin FIXED
Bug #CREAM-77 List index error from persistent estimator FIXED
Bug #CREAM-75 CREAM should avoid to log the error messages by including even the full stack trace (i.e printStackTrace()) FIXED

Standard conformance tests

Glue 1 Compliance - PASSED

  • [traldi@cert-16 ~]$ glue-validator -H cream-22.pd.infn.it -p 2170 -b o=grid -g glue1
    Validating data types. ... ok
    Verifying that attributes are not empty. ... ok
    Verifying the existence of mandatory attributes. ... ok
    Verifying the object class ... ok
    Verifying single-valued attributes only have one value. ... ok
    Validating data types. ... ok
    Verifying that attributes are not empty. ... ok
    Verifying the existence of mandatory attributes. ... ok
    Verifying the object class ... ok
    Verifying single-valued attributes only have one value. ... ok
    Validating data types. ... ok
    Verifying that attributes are not empty. ... ok
    Verifying the existence of mandatory attributes. ... ok
    Verifying the object class ... ok
    Verifying single-valued attributes only have one value. ... ok
    Validating data types. ... ok
    Verifying that attributes are not empty. ... ok
    Verifying the existence of mandatory attributes. ... ok
    Verifying the object class ... ok
    Verifying single-valued attributes only have one value. ... ok
    Validating data types. ... ok
    Verifying that attributes are not empty. ... ok
    Verifying the existence of mandatory attributes. ... ok
    Verifying the object class ... ok
    Verifying single-valued attributes only have one value. ... ok
    Validating data types. ... ok
    Verifying that attributes are not empty. ... ok
    Verifying the existence of mandatory attributes. ... ok
    Verifying the object class ... ok
    Verifying single-valued attributes only have one value. ... ok
    Validating data types. ... ok
    Verifying that attributes are not empty. ... ok
    Verifying the existence of mandatory attributes. ... ok
    Verifying the object class ... ok
    Verifying single-valued attributes only have one value. ... ok
    Validating data types. ... ok
    Verifying that attributes are not empty. ... ok
    Verifying the existence of mandatory attributes. ... ok
    Verifying the object class ... ok
    Verifying single-valued attributes only have one value. ... ok
    Validating data types. ... ok
    Verifying that attributes are not empty. ... ok
    Verifying the existence of mandatory attributes. ... ok
    Verifying the object class ... ok
    Verifying single-valued attributes only have one value. ... ok
    Validating data types. ... ok
    Verifying that attributes are not empty. ... ok
    Verifying the existence of mandatory attributes. ... ok
    Verifying the object class ... ok
    Verifying single-valued attributes only have one value. ... ok
    Validating data types. ... ok
    Verifying that attributes are not empty. ... ok
    Verifying the existence of mandatory attributes. ... ok
    Verifying the object class ... ok
    Verifying single-valued attributes only have one value. ... ok
    Validating data types. ... ok
    Verifying that attributes are not empty. ... ok
    Verifying the existence of mandatory attributes. ... ok
    Verifying the object class ... ok
    Verifying single-valued attributes only have one value. ... ok
    Validating data types. ... ok
    Verifying that attributes are not empty. ... ok
    Verifying the existence of mandatory attributes. ... ok
    Verifying the object class ... ok
    Verifying single-valued attributes only have one value. ... ok
    Validating data types. ... ok
    Verifying that attributes are not empty. ... ok
    Verifying the existence of mandatory attributes. ... ok
    Verifying the object class ... ok
    Verifying single-valued attributes only have one value. ... ok
    Validating data types. ... ok
    Verifying that attributes are not empty. ... ok
    Verifying the existence of mandatory attributes. ... ok
    Verifying the object class ... ok
    Verifying single-valued attributes only have one value. ... ok
    Validating data types. ... ok
    Verifying that attributes are not empty. ... ok
    Verifying the existence of mandatory attributes. ... ok
    Verifying the object class ... ok
    Verifying single-valued attributes only have one value. ... ok
    Validating data types. ... ok
    Verifying that attributes are not empty. ... ok
    Verifying the existence of mandatory attributes. ... ok
    Verifying the object class ... ok
    Verifying single-valued attributes only have one value. ... ok
    Validating data types. ... ok
    Verifying that attributes are not empty. ... ok
    Verifying the existence of mandatory attributes. ... ok
    Verifying the object class ... ok
    Verifying single-valued attributes only have one value. ... ok
    Validating data types. ... ok
    Verifying that attributes are not empty. ... ok
    Verifying the existence of mandatory attributes. ... ok
    Verifying the object class ... ok
    Verifying single-valued attributes only have one value. ... ok
    Validating data types. ... ok
    Verifying that attributes are not empty. ... ok
    Verifying the existence of mandatory attributes. ... ok
    Verifying the object class ... ok
    Verifying single-valued attributes only have one value. ... ok
    Validating data types. ... ok
    Verifying that attributes are not empty. ... ok
    Verifying the existence of mandatory attributes. ... ok
    Verifying the object class ... ok
    Verifying single-valued attributes only have one value. ... ok
    Validating data types. ... ok
    Verifying that attributes are not empty. ... ok
    Verifying the existence of mandatory attributes. ... ok
    Verifying the object class ... ok
    Verifying single-valued attributes only have one value. ... ok
    Validating data types. ... ok
    Verifying that attributes are not empty. ... ok
    Verifying the existence of mandatory attributes. ... ok
    Verifying the object class ... ok
    Verifying single-valued attributes only have one value. ... ok
    Validating data types. ... ok
    Verifying that attributes are not empty. ... ok
    Verifying the existence of mandatory attributes. ... ok
    Verifying the object class ... ok
    Verifying single-valued attributes only have one value. ... ok
    Validating data types. ... ok
    Verifying that attributes are not empty. ... ok
    Verifying the existence of mandatory attributes. ... ok
    Verifying the object class ... ok
    Verifying single-valued attributes only have one value. ... ok
    Validating data types. ... ok
    Verifying that attributes are not empty. ... ok
    Verifying the existence of mandatory attributes. ... ok
    Verifying the object class ... ok
    Verifying single-valued attributes only have one value. ... ok
    Validating data types. ... ok
    Verifying that attributes are not empty. ... ok
    Verifying the existence of mandatory attributes. ... ok
    Verifying the object class ... ok
    Verifying single-valued attributes only have one value. ... ok
    Validating data types. ... ok
    Verifying that attributes are not empty. ... ok
    Verifying the existence of mandatory attributes. ... ok
    Verifying the object class ... ok
    Verifying single-valued attributes only have one value. ... ok
    Validating data types. ... ok
    Verifying that attributes are not empty. ... ok
    Verifying the existence of mandatory attributes. ... ok
    Verifying the object class ... ok
    Verifying single-valued attributes only have one value. ... ok
    Validating data types. ... ok
    Verifying that attributes are not empty. ... ok
    Verifying the existence of mandatory attributes. ... ok
    Verifying the object class ... ok
    Verifying single-valued attributes only have one value. ... ok
    Validating data types. ... ok
    Verifying that attributes are not empty. ... ok
    Verifying the existence of mandatory attributes. ... ok
    Verifying the object class ... ok
    Verifying single-valued attributes only have one value. ... ok
    Validating data types. ... ok
    Verifying that attributes are not empty. ... ok
    Verifying the existence of mandatory attributes. ... ok
    Verifying the object class ... ok
    Verifying single-valued attributes only have one value. ... ok
    
    ----------------------------------------------------------------------
    Ran 160 tests in 0.023s
    
    OK
    

Glue 2 Compliance - PASSED with some errors

[traldi@cert-16 ~]$ glue-validator -H cream-22.pd.infn.it -p 2170 -b o=glue -g glue2
Validating data types. ... FAIL
Verifying that attributes are not empty. ... ok
Verifying the existence of mandatory attributes. ... ok
Verifying the object class ... ok
Verifying single-valued attributes only have one value. ... ok
Validating data types. ... ok
Verifying that attributes are not empty. ... ok
Verifying the existence of mandatory attributes. ... ok
Verifying the object class ... ok
Verifying single-valued attributes only have one value. ... ok
Validating data types. ... ok
Verifying that attributes are not empty. ... ok
Verifying the existence of mandatory attributes. ... ok
Verifying the object class ... ok
Verifying single-valued attributes only have one value. ... ok
Validating data types. ... ok
Verifying that attributes are not empty. ... ok
Verifying the existence of mandatory attributes. ... ok
Verifying the object class ... ok
Verifying single-valued attributes only have one value. ... ok
Validating data types. ... ok
Verifying that attributes are not empty. ... ok
Verifying the existence of mandatory attributes. ... ok
Verifying the object class ... ok
Verifying single-valued attributes only have one value. ... ok
Validating data types. ... ok
Verifying that attributes are not empty. ... ok
Verifying the existence of mandatory attributes. ... ok
Verifying the object class ... ok
Verifying single-valued attributes only have one value. ... ok
Validating data types. ... ok
Verifying that attributes are not empty. ... ok
Verifying the existence of mandatory attributes. ... ok
Verifying the object class ... ok
Verifying single-valued attributes only have one value. ... ok
Validating data types. ... ok
Verifying that attributes are not empty. ... ok
Verifying the existence of mandatory attributes. ... ok
Verifying the object class ... ok
Verifying single-valued attributes only have one value. ... ok
Validating data types. ... ok
Verifying that attributes are not empty. ... ok
Verifying the existence of mandatory attributes. ... ok
Verifying the object class ... ok
Verifying single-valued attributes only have one value. ... ok
Validating data types. ... ok
Verifying that attributes are not empty. ... ok
Verifying the existence of mandatory attributes. ... ok
Verifying the object class ... ok
Verifying single-valued attributes only have one value. ... ok
Validating data types. ... ok
Verifying that attributes are not empty. ... ok
Verifying the existence of mandatory attributes. ... ok
Verifying the object class ... ok
Verifying single-valued attributes only have one value. ... ok
Validating data types. ... FAIL
Verifying that attributes are not empty. ... ok
Verifying the existence of mandatory attributes. ... ok
Verifying the object class ... ok
Verifying single-valued attributes only have one value. ... ok
Validating data types. ... ok
Verifying that attributes are not empty. ... ok
Verifying the existence of mandatory attributes. ... ok
Verifying the object class ... ok
Verifying single-valued attributes only have one value. ... ok
Validating data types. ... ok
Verifying that attributes are not empty. ... ok
Verifying the existence of mandatory attributes. ... ok
Verifying the object class ... ok
Verifying single-valued attributes only have one value. ... ok
Validating data types. ... FAIL
Verifying that attributes are not empty. ... ok
Verifying the existence of mandatory attributes. ... ok
Verifying the object class ... ok
Verifying single-valued attributes only have one value. ... ok
Validating data types. ... FAIL
Verifying that attributes are not empty. ... ok
Verifying the existence of mandatory attributes. ... ok
Verifying the object class ... ok
Verifying single-valued attributes only have one value. ... ok
Validating data types. ... ok
Verifying that attributes are not empty. ... ok
Verifying the existence of mandatory attributes. ... ok
Verifying the object class ... ok
Verifying single-valued attributes only have one value. ... ok
Validating data types. ... ok
Verifying that attributes are not empty. ... ok
Verifying the existence of mandatory attributes. ... ok
Verifying the object class ... ok
Verifying single-valued attributes only have one value. ... ok
Validating data types. ... FAIL
Verifying that attributes are not empty. ... ok
Verifying the existence of mandatory attributes. ... ok
Verifying the object class ... ok
Verifying single-valued attributes only have one value. ... ok
Validating data types. ... ok
Verifying that attributes are not empty. ... ok
Verifying the existence of mandatory attributes. ... ok
Verifying the object class ... ok
Verifying single-valued attributes only have one value. ... ok
Validating data types. ... ok
Verifying that attributes are not empty. ... ok
Verifying the existence of mandatory attributes. ... ok
Verifying the object class ... ok
Verifying single-valued attributes only have one value. ... ok
Validating data types. ... ok
Verifying that attributes are not empty. ... ok
Verifying the existence of mandatory attributes. ... ok
Verifying the object class ... ok
Verifying single-valued attributes only have one value. ... ok
Validating data types. ... ok
Verifying that attributes are not empty. ... ok
Verifying the existence of mandatory attributes. ... ok
Verifying the object class ... ok
Verifying single-valued attributes only have one value. ... ok
Validating data types. ... ok
Verifying that attributes are not empty. ... ok
Verifying the existence of mandatory attributes. ... ok
Verifying the object class ... ok
Verifying single-valued attributes only have one value. ... ok
Validating data types. ... ok
Verifying that attributes are not empty. ... ok
Verifying the existence of mandatory attributes. ... ok
Verifying the object class ... ok
Verifying single-valued attributes only have one value. ... ok
Validating data types. ... FAIL
Verifying that attributes are not empty. ... ok
Verifying the existence of mandatory attributes. ... ok
Verifying the object class ... ok
Verifying single-valued attributes only have one value. ... ok
Validating data types. ... ok
Verifying that attributes are not empty. ... ok
Verifying the existence of mandatory attributes. ... ok
Verifying the object class ... ok
Verifying single-valued attributes only have one value. ... ok
Validating data types. ... FAIL
Verifying that attributes are not empty. ... ok
Verifying the existence of mandatory attributes. ... ok
Verifying the object class ... ok
Verifying single-valued attributes only have one value. ... ok
Validating data types. ... ok
Verifying that attributes are not empty. ... ok
Verifying the existence of mandatory attributes. ... ok
Verifying the object class ... ok
Verifying single-valued attributes only have one value. ... ok
Validating data types. ... FAIL
Verifying that attributes are not empty. ... ok
Verifying the existence of mandatory attributes. ... ok
Verifying the object class ... ok
Verifying single-valued attributes only have one value. ... ok
Validating data types. ... ok
Verifying that attributes are not empty. ... ok
Verifying the existence of mandatory attributes. ... ok
Verifying the object class ... ok
Verifying single-valued attributes only have one value. ... ok
Validating data types. ... ok
Verifying that attributes are not empty. ... ok
Verifying the existence of mandatory attributes. ... ok
Verifying the object class ... ok
Verifying single-valued attributes only have one value. ... ok
Validating data types. ... ok
Verifying that attributes are not empty. ... ok
Verifying the existence of mandatory attributes. ... ok
Verifying the object class ... ok
Verifying single-valued attributes only have one value. ... ok
Validating data types. ... ok
Verifying that attributes are not empty. ... ok
Verifying the existence of mandatory attributes. ... ok
Verifying the object class ... ok
Verifying single-valued attributes only have one value. ... ok
Validating data types. ... ok
Verifying that attributes are not empty. ... ok
Verifying the existence of mandatory attributes. ... ok
Verifying the object class ... ok
Verifying single-valued attributes only have one value. ... ok
Validating data types. ... ok
Verifying that attributes are not empty. ... ok
Verifying the existence of mandatory attributes. ... ok
Verifying the object class ... ok
Verifying single-valued attributes only have one value. ... ok
Validating data types. ... ok
Verifying that attributes are not empty. ... ok
Verifying the existence of mandatory attributes. ... ok
Verifying the object class ... ok
Verifying single-valued attributes only have one value. ... ok
Validating data types. ... ok
Verifying that attributes are not empty. ... ok
Verifying the existence of mandatory attributes. ... ok
Verifying the object class ... ok
Verifying single-valued attributes only have one value. ... ok
Validating data types. ... FAIL
Verifying that attributes are not empty. ... ok
Verifying the existence of mandatory attributes. ... ok
Verifying the object class ... ok
Verifying single-valued attributes only have one value. ... ok
Validating data types. ... ok
Verifying that attributes are not empty. ... ok
Verifying the existence of mandatory attributes. ... ok
Verifying the object class ... ok
Verifying single-valued attributes only have one value. ... ok
Validating data types. ... ok
Verifying that attributes are not empty. ... ok
Verifying the existence of mandatory attributes. ... ok
Verifying the object class ... ok
Verifying single-valued attributes only have one value. ... ok
Validating data types. ... ok
Verifying that attributes are not empty. ... ok
Verifying the existence of mandatory attributes. ... ok
Verifying the object class ... ok
Verifying single-valued attributes only have one value. ... ok
Validating data types. ... ok
Verifying that attributes are not empty. ... ok
Verifying the existence of mandatory attributes. ... ok
Verifying the object class ... ok
Verifying single-valued attributes only have one value. ... ok
Validating data types. ... FAIL
Verifying that attributes are not empty. ... ok
Verifying the existence of mandatory attributes. ... ok
Verifying the object class ... ok
Verifying single-valued attributes only have one value. ... ok
Validating data types. ... ok
Verifying that attributes are not empty. ... ok
Verifying the existence of mandatory attributes. ... ok
Verifying the object class ... ok
Verifying single-valued attributes only have one value. ... ok
Validating data types. ... ok
Verifying that attributes are not empty. ... ok
Verifying the existence of mandatory attributes. ... ok
Verifying the object class ... ok
Verifying single-valued attributes only have one value. ... ok
Validating data types. ... ok
Verifying that attributes are not empty. ... ok
Verifying the existence of mandatory attributes. ... ok
Verifying the object class ... ok
Verifying single-valued attributes only have one value. ... ok
Validating data types. ... ok
Verifying that attributes are not empty. ... ok
Verifying the existence of mandatory attributes. ... ok
Verifying the object class ... ok
Verifying single-valued attributes only have one value. ... ok
Validating data types. ... ok
Verifying that attributes are not empty. ... ok
Verifying the existence of mandatory attributes. ... ok
Verifying the object class ... ok
Verifying single-valued attributes only have one value. ... ok
Validating data types. ... ok
Verifying that attributes are not empty. ... ok
Verifying the existence of mandatory attributes. ... ok
Verifying the object class ... ok
Verifying single-valued attributes only have one value. ... ok
Validating data types. ... ok
Verifying that attributes are not empty. ... ok
Verifying the existence of mandatory attributes. ... ok
Verifying the object class ... ok
Verifying single-valued attributes only have one value. ... ok
Validating data types. ... ok
Verifying that attributes are not empty. ... ok
Verifying the existence of mandatory attributes. ... ok
Verifying the object class ... ok
Verifying single-valued attributes only have one value. ... ok
Validating data types. ... FAIL
Verifying that attributes are not empty. ... ok
Verifying the existence of mandatory attributes. ... ok
Verifying the object class ... ok
Verifying single-valued attributes only have one value. ... ok

======================================================================
FAIL: Validating data types.
----------------------------------------------------------------------
Traceback (most recent call last):
  File "/usr/lib/python2.6/site-packages/validator/EntryTest.py", line 92, in test_data_types
    self.assertTrue(status, message)
AssertionError: WARNING START:
W037 Description: Wrong type
W037 Affected DN: GLUE2ShareID=creamtest2_dteam_cream-22.pd.infn.it_ComputingElement,GLUE2ServiceID=cream-22.pd.infn.it_ComputingElement,GLUE2GroupID=resource,o=glue
W037 Affected attribute: GLUE2ComputingShareServingState
W037 Published value: ['testing'] 
W037 Additional information: Expected type is ServingState_t
WARNING END


======================================================================
FAIL: Validating data types.
----------------------------------------------------------------------
Traceback (most recent call last):
  File "/usr/lib/python2.6/site-packages/validator/EntryTest.py", line 92, in test_data_types
    self.assertTrue(status, message)
AssertionError: WARNING START:
W037 Description: Wrong type
W037 Affected DN: GLUE2ShareID=creamtest2_testers.eu-emi.eu_cream-22.pd.infn.it_ComputingElement,GLUE2ServiceID=cream-22.pd.infn.it_ComputingElement,GLUE2GroupID=resource,o=glue
W037 Affected attribute: GLUE2ComputingShareServingState
W037 Published value: ['testing'] 
W037 Additional information: Expected type is ServingState_t
WARNING END


======================================================================
FAIL: Validating data types.
----------------------------------------------------------------------
Traceback (most recent call last):
  File "/usr/lib/python2.6/site-packages/validator/EntryTest.py", line 92, in test_data_types
    self.assertTrue(status, message)
AssertionError: WARNING START:
W037 Description: Wrong type
W037 Affected DN: GLUE2ShareID=cert_testers.eu-emi.eu_cream-22.pd.infn.it_ComputingElement,GLUE2ServiceID=cream-22.pd.infn.it_ComputingElement,GLUE2GroupID=resource,o=glue
W037 Affected attribute: GLUE2ComputingShareServingState
W037 Published value: ['testing'] 
W037 Additional information: Expected type is ServingState_t
WARNING END


======================================================================
FAIL: Validating data types.
----------------------------------------------------------------------
Traceback (most recent call last):
  File "/usr/lib/python2.6/site-packages/validator/EntryTest.py", line 92, in test_data_types
    self.assertTrue(status, message)
AssertionError: WARNING START:
W037 Description: Wrong type
W037 Affected DN: GLUE2ShareID=creamtest2_infngrid_cream-22.pd.infn.it_ComputingElement,GLUE2ServiceID=cream-22.pd.infn.it_ComputingElement,GLUE2GroupID=resource,o=glue
W037 Affected attribute: GLUE2ComputingShareServingState
W037 Published value: ['testing'] 
W037 Additional information: Expected type is ServingState_t
WARNING END


======================================================================
FAIL: Validating data types.
----------------------------------------------------------------------
Traceback (most recent call last):
  File "/usr/lib/python2.6/site-packages/validator/EntryTest.py", line 92, in test_data_types
    self.assertTrue(status, message)
AssertionError: WARNING START:
W037 Description: Wrong type
W037 Affected DN: GLUE2ShareID=creamtest1_cms_cream-22.pd.infn.it_ComputingElement,GLUE2ServiceID=cream-22.pd.infn.it_ComputingElement,GLUE2GroupID=resource,o=glue
W037 Affected attribute: GLUE2ComputingShareServingState
W037 Published value: ['testing'] 
W037 Additional information: Expected type is ServingState_t
WARNING END


======================================================================
FAIL: Validating data types.
----------------------------------------------------------------------
Traceback (most recent call last):
  File "/usr/lib/python2.6/site-packages/validator/EntryTest.py", line 92, in test_data_types
    self.assertTrue(status, message)
AssertionError: WARNING START:
W037 Description: Wrong type
W037 Affected DN: GLUE2ShareID=creamtest1_infngrid_cream-22.pd.infn.it_ComputingElement,GLUE2ServiceID=cream-22.pd.infn.it_ComputingElement,GLUE2GroupID=resource,o=glue
W037 Affected attribute: GLUE2ComputingShareServingState
W037 Published value: ['testing'] 
W037 Additional information: Expected type is ServingState_t
WARNING END


======================================================================
FAIL: Validating data types.
----------------------------------------------------------------------
Traceback (most recent call last):
  File "/usr/lib/python2.6/site-packages/validator/EntryTest.py", line 92, in test_data_types
    self.assertTrue(status, message)
AssertionError: WARNING START:
W037 Description: Wrong type
W037 Affected DN: GLUE2ShareID=creamtest1_testers.eu-emi.eu_cream-22.pd.infn.it_ComputingElement,GLUE2ServiceID=cream-22.pd.infn.it_ComputingElement,GLUE2GroupID=resource,o=glue
W037 Affected attribute: GLUE2ComputingShareServingState
W037 Published value: ['testing'] 
W037 Additional information: Expected type is ServingState_t
WARNING END


======================================================================
FAIL: Validating data types.
----------------------------------------------------------------------
Traceback (most recent call last):
  File "/usr/lib/python2.6/site-packages/validator/EntryTest.py", line 92, in test_data_types
    self.assertTrue(status, message)
AssertionError: WARNING START:
W037 Description: Wrong type
W037 Affected DN: GLUE2ShareID=cert_dteam_cream-22.pd.infn.it_ComputingElement,GLUE2ServiceID=cream-22.pd.infn.it_ComputingElement,GLUE2GroupID=resource,o=glue
W037 Affected attribute: GLUE2ComputingShareServingState
W037 Published value: ['testing'] 
W037 Additional information: Expected type is ServingState_t
WARNING END


======================================================================
FAIL: Validating data types.
----------------------------------------------------------------------
Traceback (most recent call last):
  File "/usr/lib/python2.6/site-packages/validator/EntryTest.py", line 92, in test_data_types
    self.assertTrue(status, message)
AssertionError: WARNING START:
W037 Description: Wrong type
W037 Affected DN: GLUE2ShareID=creamtest1_dteam_cream-22.pd.infn.it_ComputingElement,GLUE2ServiceID=cream-22.pd.infn.it_ComputingElement,GLUE2GroupID=resource,o=glue
W037 Affected attribute: GLUE2ComputingShareServingState
W037 Published value: ['testing'] 
W037 Additional information: Expected type is ServingState_t
WARNING END


======================================================================
FAIL: Validating data types.
----------------------------------------------------------------------
Traceback (most recent call last):
  File "/usr/lib/python2.6/site-packages/validator/EntryTest.py", line 92, in test_data_types
    self.assertTrue(status, message)
AssertionError: WARNING START:
W037 Description: Wrong type
W037 Affected DN: GLUE2ShareID=creamtest2_cms_cream-22.pd.infn.it_ComputingElement,GLUE2ServiceID=cream-22.pd.infn.it_ComputingElement,GLUE2GroupID=resource,o=glue
W037 Affected attribute: GLUE2ComputingShareServingState
W037 Published value: ['testing'] 
W037 Additional information: Expected type is ServingState_t
WARNING END


======================================================================
FAIL: Validating data types.
----------------------------------------------------------------------
Traceback (most recent call last):
  File "/usr/lib/python2.6/site-packages/validator/EntryTest.py", line 92, in test_data_types
    self.assertTrue(status, message)
AssertionError: WARNING START:
W037 Description: Wrong type
W037 Affected DN: GLUE2EndpointID=cream-22.pd.infn.it_ComputingElement_org.glite.ce.ApplicationPublisher_1068561884,GLUE2ServiceID=cream-22.pd.infn.it_ComputingElement,GLUE2GroupID=resource,o=glue
W037 Affected attribute: GLUE2EndpointInterfaceName
W037 Published value: ['org.glite.ce.ApplicationPublisher'] 
W037 Additional information: Expected type is InterfaceName_t
WARNING END


----------------------------------------------------------------------
Ran 265 tests in 0.042s

FAILED (failures=11)

Errors are because of use of a State value not defined in the default glue-validator table.

Performance and scalability tests

Integration testing

Tests described:

-- SergioTraldi - 2013-07-29

Edit | Attach | PDF | History: r6 | r4 < r3 < r2 < r1 | Backlinks | Raw View | More topic actions...
Topic revision: r2 - 2013-07-29 - SergioTraldi
 
  • Edit
  • Attach
This site is powered by the TWiki collaboration platformCopyright © 2008-2022 by the contributing authors. All material on this collaboration platform is the property of the contributing authors.
Ideas, requests, problems regarding TWiki? Send feedback