Tags:
, view all tags

CREAM v. 1.14.5 - Testing report SL6: IGIRTC-157

Summary

  • Product: CREAM v. 1.14.5
  • Release Task: IGIRTC-157
  • ETICS Subsystem Configuration Name:
  • VCS Tag:
  • EMI Major Release: EMI 2 (Matterhorn)
  • Platform: SL6 epel
  • Author: Sergio Traldi
  • Testing report: Testing Report file
  • Certification report: Certification Report file
  • Outcome: "Certifiied*

Deployment tests

Clean Installation

CREAM PBS

CREAM LSF

Upgrade Installation

CREAM PBS

CREAM LSF

Unit Tests Passed

  • Available at: [[][ Unit Test report]]

System tests

Authentication using GJAF

Functionality tests

CREAM PBS

[traldi@cert-16 ~]$ pybot -e glue /opt/cream_test/testsuite/cream_test_suite.html
INFO: The files of this testsuite will be stored under: /tmp/tmpvlh0A4.cream_testing/
==============================================================================
Cream Test Suite :: This is the main testing module,needed for testing the ...
==============================================================================
Set Log Level :: Set the log level used for the test suite. This c... | PASS |
------------------------------------------------------------------------------
Check Executables :: Check whether the needed executables for the ... | PASS |
------------------------------------------------------------------------------
Simple Submit :: Execute /bin/uname -a.Submit the jdl and wait for... | PASS |
------------------------------------------------------------------------------
ISB Base URI :: Execute a bash shell script.The script is stored i... | PASS |
------------------------------------------------------------------------------
ISB Client to CE :: Execute a bash shell script.The script is stor... | PASS |
------------------------------------------------------------------------------
ISB gsiftp to CE :: Execute a bash shell script.The script is stor... | PASS |
------------------------------------------------------------------------------
OSB localhost :: Execute /bin/uname -a.Store std out and error str... | PASS |
------------------------------------------------------------------------------
OSB gsiftp BaseDestURI :: Execute /bin/uname -a.Store std out and ... | PASS |
------------------------------------------------------------------------------
OSB gsiftp DestURI :: Execute /bin/uname -a.Store std out and erro... | PASS |
------------------------------------------------------------------------------
Environment :: Execute a bash shell script.The script is stored lo... | PASS |
------------------------------------------------------------------------------
Epilogue :: Execute two bash shell scripts,one for the job and the... | PASS |
------------------------------------------------------------------------------
Prologue :: Execute two bash shell scripts,one for the job and the... | PASS |
------------------------------------------------------------------------------
Explicit Delegation :: Test job submission with explicit delegatio... | PASS |
------------------------------------------------------------------------------
Job Cancel :: Test job cancellation.Two cases are tested:             | PASS |
------------------------------------------------------------------------------
Job List :: Test the job listing cli utility.Store the list of the... | PASS |
------------------------------------------------------------------------------
Job Suspend - Resume :: Submit a job and suspend it.Wait until it'... | PASS |
------------------------------------------------------------------------------
Manually Cancel Job :: Submit a job and then manually cancel it on... | PASS |
------------------------------------------------------------------------------
Verify CE service info :: This test case verifies the output of th... | PASS |
------------------------------------------------------------------------------
Enable - Disable Submission :: This test case tests the proper fun... | PASS |
------------------------------------------------------------------------------
Job Purge :: This test case verifies the proper functionality of t... | PASS |
------------------------------------------------------------------------------
Admin Manage Job :: This test case checks whether a user can manag... | PASS |
------------------------------------------------------------------------------
Limiter :: NOTE: This test case is about 25 minutes long!             | PASS |
------------------------------------------------------------------------------
Ban User :: This test case tests if the banning of user works. The... | PASS |
------------------------------------------------------------------------------
Sandbox Staging :: This test case tests the two different Sandbox ... | PASS |
------------------------------------------------------------------------------
Automatic Proxy Purging :: This test case checks the automatic pro... | PASS |
------------------------------------------------------------------------------
Verify Job Status Output :: This test is checking the output of th... | PASS |
------------------------------------------------------------------------------
OutputData :: This test case tests the OutputData jdl attribute. T... | PASS |
------------------------------------------------------------------------------
Automatic Job Purge :: This test case is testing the functionality... | PASS |
------------------------------------------------------------------------------
Proxy Renewal :: Submit a job lasting 20 minutes using a proxy val... | PASS |
------------------------------------------------------------------------------
CPU Allocation 1 :: Validate the contents of the batch job submiss... | PASS |
------------------------------------------------------------------------------
CPU Allocation 2 :: Validate the contents of the batch job submiss... | PASS |
------------------------------------------------------------------------------
CPU Allocation 3 :: Validate the contents of the batch job submiss... | PASS |
------------------------------------------------------------------------------
CPU Allocation 4 :: Validate the contents of the batch job submiss... | PASS |
------------------------------------------------------------------------------
CPU Allocation 5 :: Validate the contents of the batch job submiss... | PASS |
------------------------------------------------------------------------------
CPU Allocation 6 :: Validate the contents of the batch job submiss... | PASS |
------------------------------------------------------------------------------
Resource BDII :: Check if the resource bdii publishes all the rele... | PASS |
------------------------------------------------------------------------------
Logging and Bookkeeping :: Check if the logging and bookkeeping se... | PASS |
------------------------------------------------------------------------------
Old BLParser Restart :: Configure a CREAM CE using the old blah bl... | PASS |
------------------------------------------------------------------------------
Cream Test Suite :: This is the main testing module,needed for tes... | PASS |
38 critical tests, 38 passed, 0 failed
38 tests total, 38 passed, 0 failed
==============================================================================
Output:  /home/traldi/output.xml
Log:     /home/traldi/log.html
Report:  /home/traldi/report.html
  • Functionality test suite log

CREAM LSF

[traldi@cert-16 ~]$ pybot -e glue /opt/cream_test/testsuite/cream_test_suite.html
INFO: The files of this testsuite will be stored under: /tmp/tmp18E6Ja.cream_testing/
==============================================================================
Cream Test Suite :: This is the main testing module,needed for testing the ...
==============================================================================
Set Log Level :: Set the log level used for the test suite. This c... | PASS |
------------------------------------------------------------------------------
Check Executables :: Check whether the needed executables for the ... | PASS |
------------------------------------------------------------------------------
Simple Submit :: Execute /bin/uname -a.Submit the jdl and wait for... | PASS |
------------------------------------------------------------------------------
ISB Base URI :: Execute a bash shell script.The script is stored i... | PASS |
------------------------------------------------------------------------------
ISB Client to CE :: Execute a bash shell script.The script is stor... | PASS |
------------------------------------------------------------------------------
ISB gsiftp to CE :: Execute a bash shell script.The script is stor... | PASS |
------------------------------------------------------------------------------
OSB localhost :: Execute /bin/uname -a.Store std out and error str... | PASS |
------------------------------------------------------------------------------
OSB gsiftp BaseDestURI :: Execute /bin/uname -a.Store std out and ... | PASS |
------------------------------------------------------------------------------
OSB gsiftp DestURI :: Execute /bin/uname -a.Store std out and erro... | PASS |
------------------------------------------------------------------------------
Environment :: Execute a bash shell script.The script is stored lo... | PASS |
------------------------------------------------------------------------------
Epilogue :: Execute two bash shell scripts,one for the job and the... | PASS |
------------------------------------------------------------------------------
Prologue :: Execute two bash shell scripts,one for the job and the... | PASS |
------------------------------------------------------------------------------
Explicit Delegation :: Test job submission with explicit delegatio... | PASS |
------------------------------------------------------------------------------
Job Cancel :: Test job cancellation.Two cases are tested:             | PASS |
------------------------------------------------------------------------------
Job List :: Test the job listing cli utility.Store the list of the... | PASS |
------------------------------------------------------------------------------
Job Suspend - Resume :: Submit a job and suspend it.Wait until it'... | PASS |
------------------------------------------------------------------------------
Manually Cancel Job :: Submit a job and then manually cancel it on... | PASS |
------------------------------------------------------------------------------
Verify CE service info :: This test case verifies the output of th... | PASS |
------------------------------------------------------------------------------
Enable - Disable Submission :: This test case tests the proper fun... | PASS |
------------------------------------------------------------------------------
Job Purge :: This test case verifies the proper functionality of t... | PASS |
------------------------------------------------------------------------------
Admin Manage Job :: This test case checks whether a user can manag... | PASS |
------------------------------------------------------------------------------
Limiter :: NOTE: This test case is about 25 minutes long!             | PASS |
------------------------------------------------------------------------------
Ban User :: This test case tests if the banning of user works. The... | PASS |
------------------------------------------------------------------------------
Sandbox Staging :: This test case tests the two different Sandbox ... | PASS |
------------------------------------------------------------------------------
Automatic Proxy Purging :: This test case checks the automatic pro... | PASS |
------------------------------------------------------------------------------
Verify Job Status Output :: This test is checking the output of th... | PASS |
------------------------------------------------------------------------------
OutputData :: This test case tests the OutputData jdl attribute. T... | PASS |
------------------------------------------------------------------------------
Automatic Job Purge :: This test case is testing the functionality... | PASS |
------------------------------------------------------------------------------
Proxy Renewal :: Submit a job lasting 20 minutes using a proxy val... | PASS |
------------------------------------------------------------------------------
CPU Allocation 1 :: Validate the contents of the batch job submiss... | PASS |
------------------------------------------------------------------------------
CPU Allocation 2 :: Validate the contents of the batch job submiss... | PASS |
------------------------------------------------------------------------------
CPU Allocation 3 :: Validate the contents of the batch job submiss... | PASS |
------------------------------------------------------------------------------
CPU Allocation 4 :: Validate the contents of the batch job submiss... | PASS |
------------------------------------------------------------------------------
CPU Allocation 5 :: Validate the contents of the batch job submiss... | PASS |
------------------------------------------------------------------------------
CPU Allocation 6 :: Validate the contents of the batch job submiss... | PASS |
------------------------------------------------------------------------------
Resource BDII :: Check if the resource bdii publishes all the rele... | PASS |
------------------------------------------------------------------------------
Logging and Bookkeeping :: Check if the logging and bookkeeping se... | PASS |
------------------------------------------------------------------------------
Old BLParser Restart :: Configure a CREAM CE using the old blah bl... | PASS |
------------------------------------------------------------------------------
Cream Test Suite :: This is the main testing module,needed for tes... | PASS |
38 critical tests, 38 passed, 0 failed
38 tests total, 38 passed, 0 failed
==============================================================================
Output:  /home/traldi/output.xml
Log:     /home/traldi/log.html
Report:  /home/traldi/report.html

  • Functionality test suite log

Regression tests

Bug #CREAM-111 Wrong tokenization for epilogue argument list FIXED

Bug #CREAM-101 Wrong time format for MaxWallClockTime FIXED

From UI:

[traldi@cert-16 ~]$ ldapsearch -x -H ldap://cream-31.pd.infn.it:2170 -b o=grid | grep GlueCEPolicyMaxWallClockTime
GlueCEPolicyMaxWallClockTime: 4320
GlueCEPolicyMaxWallClockTime: 4320
GlueCEPolicyMaxWallClockTime: 4320

[traldi@cert-16 ~]$ ldapsearch -x -H ldap://cream-31.pd.infn.it:2170 -b o=grid | grep GlueCEPolicyMaxObtainableWallClockTime
GlueCEPolicyMaxObtainableWallClockTime: 4320
GlueCEPolicyMaxObtainableWallClockTime: 4320
GlueCEPolicyMaxObtainableWallClockTime: 4320

[traldi@cert-16 ~]$ ldapsearch -x -H ldap://cream-31.pd.infn.it:2170 -b o=glue | grep GLUE2ComputingShareDefaultWallTime
GLUE2ComputingShareDefaultWallTime: 259200
GLUE2ComputingShareDefaultWallTime: 259200
GLUE2ComputingShareDefaultWallTime: 259200
GLUE2ComputingShareDefaultWallTime: 259200
GLUE2ComputingShareDefaultWallTime: 259200
GLUE2ComputingShareDefaultWallTime: 259200
GLUE2ComputingShareDefaultWallTime: 259200
GLUE2ComputingShareDefaultWallTime: 259200

[traldi@cert-16 ~]$ ldapsearch -x -H ldap://cream-31.pd.infn.it:2170 -b o=glue | grep GLUE2ComputingShareMaxWallTime
GLUE2ComputingShareMaxWallTime: 259200
GLUE2ComputingShareMaxWallTime: 259200
GLUE2ComputingShareMaxWallTime: 259200
GLUE2ComputingShareMaxWallTime: 259200
GLUE2ComputingShareMaxWallTime: 259200
GLUE2ComputingShareMaxWallTime: 259200
GLUE2ComputingShareMaxWallTime: 259200
GLUE2ComputingShareMaxWallTime: 259200

From CE:

[root@cream-31 ~]# qmgr -c 'list queue cert' | grep walltime
        resources_max.walltime = 72:00:00

Bug #CREAM-99 Python error on ERT calculation: local variable 'est' referenced before assignment FIXED

Bug #CREAM-84 The DelegationPurger may cause a java.lang.OutOfMemoryError exception FIXED

Bug #CREAM-83 CREAM should be able to immediately kill also queued jobs, when the proxy is expiring FIXED
Bug #CREAM-82 Check permission for /var/cream_sandbox FIXED
Bug #CREAM-78 Check for /etc/lrms in config_cream_gip_scheduler_plugin FIXED
Bug #CREAM-77 List index error from persistent estimator FIXED
Bug #CREAM-75 CREAM should avoid to log the error messages by including even the full stack trace (i.e printStackTrace()) FIXED
Bug #99747: glite-info-dynamic-ce does not update GLUE2ComputingShareServingState FIXED
* From UI
$ glite-ce-enable-submission cert-42.pd.infn.it:8443
Operation for enabling new submissions succeeded
  • On CE
# /sbin/runuser -s /bin/sh ldap -c "/var/lib/bdii/gip/plugin/glite-info-cream-glue2" |grep ServingState
GLUE2EndpointServingState: production
* From UI
$ glite-ce-disable-submission cert-42.pd.infn.it:8443
Operation for disabling new submissions succeeded
  • On CE
# /sbin/runuser -s /bin/sh ldap -c "/var/lib/bdii/gip/plugin/glite-info-cream-glue2" |grep ServingState
GLUE2EndpointServingState: draining

Standard conformance tests

Glue 1 Compliance - PASSED

[traldi@cert-16 ~]$ glue-validator -H cream-31.pd.infn.it -p 2170 -b o=grid -g glue1
Validating data types. ... ok
Verifying that attributes are not empty. ... ok
Verifying the existence of mandatory attributes. ... ok
Verifying the object class ... ok
Verifying single-valued attributes only have one value. ... ok
Validating data types. ... ok
Verifying that attributes are not empty. ... ok
Verifying the existence of mandatory attributes. ... ok
Verifying the object class ... ok
Verifying single-valued attributes only have one value. ... ok
Validating data types. ... ok
Verifying that attributes are not empty. ... ok
Verifying the existence of mandatory attributes. ... ok
Verifying the object class ... ok
Verifying single-valued attributes only have one value. ... ok
Validating data types. ... ok
Verifying that attributes are not empty. ... ok
Verifying the existence of mandatory attributes. ... ok
Verifying the object class ... ok
Verifying single-valued attributes only have one value. ... ok
Validating data types. ... ok
Verifying that attributes are not empty. ... ok
Verifying the existence of mandatory attributes. ... ok
Verifying the object class ... ok
Verifying single-valued attributes only have one value. ... ok
Validating data types. ... ok
Verifying that attributes are not empty. ... ok
Verifying the existence of mandatory attributes. ... ok
Verifying the object class ... ok
Verifying single-valued attributes only have one value. ... ok
Validating data types. ... ok
Verifying that attributes are not empty. ... ok
Verifying the existence of mandatory attributes. ... ok
Verifying the object class ... ok
Verifying single-valued attributes only have one value. ... ok
Validating data types. ... ok
Verifying that attributes are not empty. ... ok
Verifying the existence of mandatory attributes. ... ok
Verifying the object class ... ok
Verifying single-valued attributes only have one value. ... ok
Validating data types. ... ok
Verifying that attributes are not empty. ... ok
Verifying the existence of mandatory attributes. ... ok
Verifying the object class ... ok
Verifying single-valued attributes only have one value. ... ok
Validating data types. ... ok
Verifying that attributes are not empty. ... ok
Verifying the existence of mandatory attributes. ... ok
Verifying the object class ... ok
Verifying single-valued attributes only have one value. ... ok
Validating data types. ... ok
Verifying that attributes are not empty. ... ok
Verifying the existence of mandatory attributes. ... ok
Verifying the object class ... ok
Verifying single-valued attributes only have one value. ... ok
Validating data types. ... ok
Verifying that attributes are not empty. ... ok
Verifying the existence of mandatory attributes. ... ok
Verifying the object class ... ok
Verifying single-valued attributes only have one value. ... ok
Validating data types. ... ok
Verifying that attributes are not empty. ... ok
Verifying the existence of mandatory attributes. ... ok
Verifying the object class ... ok
Verifying single-valued attributes only have one value. ... ok
Validating data types. ... ok
Verifying that attributes are not empty. ... ok
Verifying the existence of mandatory attributes. ... ok
Verifying the object class ... ok
Verifying single-valued attributes only have one value. ... ok
Validating data types. ... ok
Verifying that attributes are not empty. ... ok
Verifying the existence of mandatory attributes. ... ok
Verifying the object class ... ok
Verifying single-valued attributes only have one value. ... ok
Validating data types. ... ok
Verifying that attributes are not empty. ... ok
Verifying the existence of mandatory attributes. ... ok
Verifying the object class ... ok
Verifying single-valued attributes only have one value. ... ok
Validating data types. ... ok
Verifying that attributes are not empty. ... ok
Verifying the existence of mandatory attributes. ... ok
Verifying the object class ... ok
Verifying single-valued attributes only have one value. ... ok
Validating data types. ... ok
Verifying that attributes are not empty. ... ok
Verifying the existence of mandatory attributes. ... ok
Verifying the object class ... ok
Verifying single-valued attributes only have one value. ... ok
Validating data types. ... ok
Verifying that attributes are not empty. ... ok
Verifying the existence of mandatory attributes. ... ok
Verifying the object class ... ok
Verifying single-valued attributes only have one value. ... ok
Validating data types. ... ok
Verifying that attributes are not empty. ... ok
Verifying the existence of mandatory attributes. ... ok
Verifying the object class ... ok
Verifying single-valued attributes only have one value. ... ok
Validating data types. ... ok
Verifying that attributes are not empty. ... ok
Verifying the existence of mandatory attributes. ... ok
Verifying the object class ... ok
Verifying single-valued attributes only have one value. ... ok
Validating data types. ... ok
Verifying that attributes are not empty. ... ok
Verifying the existence of mandatory attributes. ... ok
Verifying the object class ... ok
Verifying single-valued attributes only have one value. ... ok
Validating data types. ... ok
Verifying that attributes are not empty. ... ok
Verifying the existence of mandatory attributes. ... ok
Verifying the object class ... ok
Verifying single-valued attributes only have one value. ... ok
Validating data types. ... ok
Verifying that attributes are not empty. ... ok
Verifying the existence of mandatory attributes. ... ok
Verifying the object class ... ok
Verifying single-valued attributes only have one value. ... ok
Validating data types. ... ok
Verifying that attributes are not empty. ... ok
Verifying the existence of mandatory attributes. ... ok
Verifying the object class ... ok
Verifying single-valued attributes only have one value. ... ok
Validating data types. ... ok
Verifying that attributes are not empty. ... ok
Verifying the existence of mandatory attributes. ... ok
Verifying the object class ... ok
Verifying single-valued attributes only have one value. ... ok
Validating data types. ... ok
Verifying that attributes are not empty. ... ok
Verifying the existence of mandatory attributes. ... ok
Verifying the object class ... ok
Verifying single-valued attributes only have one value. ... ok
Validating data types. ... ok
Verifying that attributes are not empty. ... ok
Verifying the existence of mandatory attributes. ... ok
Verifying the object class ... ok
Verifying single-valued attributes only have one value. ... ok
Validating data types. ... ok
Verifying that attributes are not empty. ... ok
Verifying the existence of mandatory attributes. ... ok
Verifying the object class ... ok
Verifying single-valued attributes only have one value. ... ok
Validating data types. ... ok
Verifying that attributes are not empty. ... ok
Verifying the existence of mandatory attributes. ... ok
Verifying the object class ... ok
Verifying single-valued attributes only have one value. ... ok

----------------------------------------------------------------------
Ran 150 tests in 0.022s

OK

Glue 2 Compliance - PASSED with some errors

[traldi@cert-16 ~]$ glue-validator -H cream-31.pd.infn.it -p 2170 -b o=glue -g glue2
Validating data types. ... FAIL
Verifying that attributes are not empty. ... ok
Verifying the existence of mandatory attributes. ... ok
Verifying the object class ... ok
Verifying single-valued attributes only have one value. ... ok
Validating data types. ... ok
Verifying that attributes are not empty. ... ok
Verifying the existence of mandatory attributes. ... ok
Verifying the object class ... ok
Verifying single-valued attributes only have one value. ... ok
Validating data types. ... ok
Verifying that attributes are not empty. ... ok
Verifying the existence of mandatory attributes. ... ok
Verifying the object class ... ok
Verifying single-valued attributes only have one value. ... ok
Validating data types. ... ok
Verifying that attributes are not empty. ... ok
Verifying the existence of mandatory attributes. ... ok
Verifying the object class ... ok
Verifying single-valued attributes only have one value. ... ok
Validating data types. ... FAIL
Verifying that attributes are not empty. ... ok
Verifying the existence of mandatory attributes. ... ok
Verifying the object class ... ok
Verifying single-valued attributes only have one value. ... ok
Validating data types. ... ok
Verifying that attributes are not empty. ... ok
Verifying the existence of mandatory attributes. ... ok
Verifying the object class ... ok
Verifying single-valued attributes only have one value. ... ok
Validating data types. ... ok
Verifying that attributes are not empty. ... ok
Verifying the existence of mandatory attributes. ... ok
Verifying the object class ... ok
Verifying single-valued attributes only have one value. ... ok
Validating data types. ... ok
Verifying that attributes are not empty. ... ok
Verifying the existence of mandatory attributes. ... ok
Verifying the object class ... ok
Verifying single-valued attributes only have one value. ... ok
Validating data types. ... FAIL
Verifying that attributes are not empty. ... ok
Verifying the existence of mandatory attributes. ... ok
Verifying the object class ... ok
Verifying single-valued attributes only have one value. ... ok
Validating data types. ... FAIL
Verifying that attributes are not empty. ... ok
Verifying the existence of mandatory attributes. ... ok
Verifying the object class ... ok
Verifying single-valued attributes only have one value. ... ok
Validating data types. ... FAIL
Verifying that attributes are not empty. ... ok
Verifying the existence of mandatory attributes. ... ok
Verifying the object class ... ok
Verifying single-valued attributes only have one value. ... ok
Validating data types. ... FAIL
Verifying that attributes are not empty. ... ok
Verifying the existence of mandatory attributes. ... ok
Verifying the object class ... ok
Verifying single-valued attributes only have one value. ... ok
Validating data types. ... ok
Verifying that attributes are not empty. ... ok
Verifying the existence of mandatory attributes. ... ok
Verifying the object class ... ok
Verifying single-valued attributes only have one value. ... ok
Validating data types. ... ok
Verifying that attributes are not empty. ... ok
Verifying the existence of mandatory attributes. ... ok
Verifying the object class ... ok
Verifying single-valued attributes only have one value. ... ok
Validating data types. ... ok
Verifying that attributes are not empty. ... ok
Verifying the existence of mandatory attributes. ... ok
Verifying the object class ... ok
Verifying single-valued attributes only have one value. ... ok
Validating data types. ... ok
Verifying that attributes are not empty. ... ok
Verifying the existence of mandatory attributes. ... ok
Verifying the object class ... ok
Verifying single-valued attributes only have one value. ... ok
Validating data types. ... ok
Verifying that attributes are not empty. ... ok
Verifying the existence of mandatory attributes. ... ok
Verifying the object class ... ok
Verifying single-valued attributes only have one value. ... ok
Validating data types. ... FAIL
Verifying that attributes are not empty. ... ok
Verifying the existence of mandatory attributes. ... ok
Verifying the object class ... ok
Verifying single-valued attributes only have one value. ... ok
Validating data types. ... ok
Verifying that attributes are not empty. ... ok
Verifying the existence of mandatory attributes. ... ok
Verifying the object class ... ok
Verifying single-valued attributes only have one value. ... ok
Validating data types. ... FAIL
Verifying that attributes are not empty. ... ok
Verifying the existence of mandatory attributes. ... ok
Verifying the object class ... ok
Verifying single-valued attributes only have one value. ... ok
Validating data types. ... FAIL
Verifying that attributes are not empty. ... ok
Verifying the existence of mandatory attributes. ... ok
Verifying the object class ... ok
Verifying single-valued attributes only have one value. ... ok
Validating data types. ... ok
Verifying that attributes are not empty. ... ok
Verifying the existence of mandatory attributes. ... ok
Verifying the object class ... ok
Verifying single-valued attributes only have one value. ... ok
Validating data types. ... ok
Verifying that attributes are not empty. ... ok
Verifying the existence of mandatory attributes. ... ok
Verifying the object class ... ok
Verifying single-valued attributes only have one value. ... ok
Validating data types. ... ok
Verifying that attributes are not empty. ... ok
Verifying the existence of mandatory attributes. ... ok
Verifying the object class ... ok
Verifying single-valued attributes only have one value. ... ok
Validating data types. ... FAIL
Verifying that attributes are not empty. ... ok
Verifying the existence of mandatory attributes. ... ok
Verifying the object class ... ok
Verifying single-valued attributes only have one value. ... ok
Validating data types. ... ok
Verifying that attributes are not empty. ... ok
Verifying the existence of mandatory attributes. ... ok
Verifying the object class ... ok
Verifying single-valued attributes only have one value. ... ok
Validating data types. ... ok
Verifying that attributes are not empty. ... ok
Verifying the existence of mandatory attributes. ... ok
Verifying the object class ... ok
Verifying single-valued attributes only have one value. ... ok
Validating data types. ... ok
Verifying that attributes are not empty. ... ok
Verifying the existence of mandatory attributes. ... ok
Verifying the object class ... ok
Verifying single-valued attributes only have one value. ... ok
Validating data types. ... ok
Verifying that attributes are not empty. ... ok
Verifying the existence of mandatory attributes. ... ok
Verifying the object class ... ok
Verifying single-valued attributes only have one value. ... ok
Validating data types. ... ok
Verifying that attributes are not empty. ... ok
Verifying the existence of mandatory attributes. ... ok
Verifying the object class ... ok
Verifying single-valued attributes only have one value. ... ok
Validating data types. ... ok
Verifying that attributes are not empty. ... ok
Verifying the existence of mandatory attributes. ... ok
Verifying the object class ... ok
Verifying single-valued attributes only have one value. ... ok
Validating data types. ... ok
Verifying that attributes are not empty. ... ok
Verifying the existence of mandatory attributes. ... ok
Verifying the object class ... ok
Verifying single-valued attributes only have one value. ... ok

======================================================================
FAIL: Validating data types.
----------------------------------------------------------------------
Traceback (most recent call last):
  File "/usr/lib/python2.6/site-packages/validator/EntryTest.py", line 92, in test_data_types
    self.assertTrue(status, message)
AssertionError: WARNING START:
W037 Description: Wrong type
W037 Affected DN: GLUE2ShareID=creamtest1_dteam_cream-31.pd.infn.it_ComputingElement,GLUE2ServiceID=cream-31.pd.infn.it_ComputingElement,GLUE2GroupID=resource,o=glue
W037 Affected attribute: GLUE2ComputingShareServingState
W037 Published value: ['testjra1'] 
W037 Additional information: Expected type is ServingState_t
WARNING END


======================================================================
FAIL: Validating data types.
----------------------------------------------------------------------
Traceback (most recent call last):
  File "/usr/lib/python2.6/site-packages/validator/EntryTest.py", line 92, in test_data_types
    self.assertTrue(status, message)
AssertionError: WARNING START:
W037 Description: Wrong type
W037 Affected DN: GLUE2ShareID=cert_dteam_cream-31.pd.infn.it_ComputingElement,GLUE2ServiceID=cream-31.pd.infn.it_ComputingElement,GLUE2GroupID=resource,o=glue
W037 Affected attribute: GLUE2ComputingShareServingState
W037 Published value: ['testjra1'] 
W037 Additional information: Expected type is ServingState_t
WARNING END


======================================================================
FAIL: Validating data types.
----------------------------------------------------------------------
Traceback (most recent call last):
  File "/usr/lib/python2.6/site-packages/validator/EntryTest.py", line 92, in test_data_types
    self.assertTrue(status, message)
AssertionError: WARNING START:
W037 Description: Wrong type
W037 Affected DN: GLUE2EndpointID=cream-31.pd.infn.it_ComputingElement_org.glite.ce.ApplicationPublisher_1068561884,GLUE2ServiceID=cream-31.pd.infn.it_ComputingElement,GLUE2GroupID=resource,o=glue
W037 Affected attribute: GLUE2EndpointInterfaceName
W037 Published value: ['org.glite.ce.ApplicationPublisher'] 
W037 Additional information: Expected type is InterfaceName_t
WARNING END


======================================================================
FAIL: Validating data types.
----------------------------------------------------------------------
Traceback (most recent call last):
  File "/usr/lib/python2.6/site-packages/validator/EntryTest.py", line 92, in test_data_types
    self.assertTrue(status, message)
AssertionError: WARNING START:
W037 Description: Wrong type
W037 Affected DN: GLUE2ResourceID=cream-31.pd.infn.it,GLUE2ServiceID=cream-31.pd.infn.it_ComputingElement,GLUE2GroupID=resource,o=glue
W037 Affected attribute: GLUE2ExecutionEnvironmentPlatform
W037 Published value: ['x86_64'] 
W037 Additional information: Expected type is Platform_t
WARNING END


======================================================================
FAIL: Validating data types.
----------------------------------------------------------------------
Traceback (most recent call last):
  File "/usr/lib/python2.6/site-packages/validator/EntryTest.py", line 92, in test_data_types
    self.assertTrue(status, message)
AssertionError: WARNING START:
W037 Description: Wrong type
W037 Affected DN: GLUE2ShareID=cert_testers.eu-emi.eu_cream-31.pd.infn.it_ComputingElement,GLUE2ServiceID=cream-31.pd.infn.it_ComputingElement,GLUE2GroupID=resource,o=glue
W037 Affected attribute: GLUE2ComputingShareServingState
W037 Published value: ['testjra1'] 
W037 Additional information: Expected type is ServingState_t
WARNING END


======================================================================
FAIL: Validating data types.
----------------------------------------------------------------------
Traceback (most recent call last):
  File "/usr/lib/python2.6/site-packages/validator/EntryTest.py", line 92, in test_data_types
    self.assertTrue(status, message)
AssertionError: WARNING START:
W037 Description: Wrong type
W037 Affected DN: GLUE2ShareID=creamtest2_infngrid_cream-31.pd.infn.it_ComputingElement,GLUE2ServiceID=cream-31.pd.infn.it_ComputingElement,GLUE2GroupID=resource,o=glue
W037 Affected attribute: GLUE2ComputingShareServingState
W037 Published value: ['testjra1'] 
W037 Additional information: Expected type is ServingState_t
WARNING END


======================================================================
FAIL: Validating data types.
----------------------------------------------------------------------
Traceback (most recent call last):
  File "/usr/lib/python2.6/site-packages/validator/EntryTest.py", line 92, in test_data_types
    self.assertTrue(status, message)
AssertionError: WARNING START:
W037 Description: Wrong type
W037 Affected DN: GLUE2ShareID=creamtest2_dteam_cream-31.pd.infn.it_ComputingElement,GLUE2ServiceID=cream-31.pd.infn.it_ComputingElement,GLUE2GroupID=resource,o=glue
W037 Affected attribute: GLUE2ComputingShareServingState
W037 Published value: ['testjra1'] 
W037 Additional information: Expected type is ServingState_t
WARNING END


======================================================================
FAIL: Validating data types.
----------------------------------------------------------------------
Traceback (most recent call last):
  File "/usr/lib/python2.6/site-packages/validator/EntryTest.py", line 92, in test_data_types
    self.assertTrue(status, message)
AssertionError: WARNING START:
W037 Description: Wrong type
W037 Affected DN: GLUE2ShareID=creamtest1_infngrid_cream-31.pd.infn.it_ComputingElement,GLUE2ServiceID=cream-31.pd.infn.it_ComputingElement,GLUE2GroupID=resource,o=glue
W037 Affected attribute: GLUE2ComputingShareServingState
W037 Published value: ['testjra1'] 
W037 Additional information: Expected type is ServingState_t
WARNING END


======================================================================
FAIL: Validating data types.
----------------------------------------------------------------------
Traceback (most recent call last):
  File "/usr/lib/python2.6/site-packages/validator/EntryTest.py", line 92, in test_data_types
    self.assertTrue(status, message)
AssertionError: WARNING START:
W037 Description: Wrong type
W037 Affected DN: GLUE2ShareID=creamtest1_testers.eu-emi.eu_cream-31.pd.infn.it_ComputingElement,GLUE2ServiceID=cream-31.pd.infn.it_ComputingElement,GLUE2GroupID=resource,o=glue
W037 Affected attribute: GLUE2ComputingShareServingState
W037 Published value: ['testjra1'] 
W037 Additional information: Expected type is ServingState_t
WARNING END


======================================================================
FAIL: Validating data types.
----------------------------------------------------------------------
Traceback (most recent call last):
  File "/usr/lib/python2.6/site-packages/validator/EntryTest.py", line 92, in test_data_types
    self.assertTrue(status, message)
AssertionError: WARNING START:
W037 Description: Wrong type
W037 Affected DN: GLUE2ShareID=creamtest2_testers.eu-emi.eu_cream-31.pd.infn.it_ComputingElement,GLUE2ServiceID=cream-31.pd.infn.it_ComputingElement,GLUE2GroupID=resource,o=glue
W037 Affected attribute: GLUE2ComputingShareServingState
W037 Published value: ['testjra1'] 
W037 Additional information: Expected type is ServingState_t
WARNING END


----------------------------------------------------------------------
Ran 160 tests in 0.024s

FAILED (failures=10)

Performance and scalability tests

Integration testing

Tests described:

-- SergioTraldi - 2013-07-29

Edit | Attach | PDF | History: r7 | r4 < r3 < r2 < r1 | Backlinks | Raw View | More topic actions...
Topic revision: r2 - 2013-07-29 - SergioTraldi
 
  • Edit
  • Attach
This site is powered by the TWiki collaboration platformCopyright © 2008-2021 by the contributing authors. All material on this collaboration platform is the property of the contributing authors.
Ideas, requests, problems regarding TWiki? Send feedback