Tags:
, view all tags

WMS 3.6.4 test report - IGIRTC-175

Deployment tests

Testing SL5

  • WMS 3.6.4 SL5 test reports -
    • Install packages -
    • Update packages -

Testing SL6

  • WMS 3.6.4 SL6 test reports -
    • Install packages -
    • Update packages -
    • log_to_add - with regression

Functionality tests

Job submission - SOME FAILURES

[capannini@emitestbed54 WMSTaskIGIRTC175]$ pybot ~/git/WMS-Test-Suite/robot_testsuites/wms_tests/testsuites/WMS-service/WMS-job-cycle.html
==============================================================================
WMS-job-cycle :: WMS Job Cycle Test Suite                                     
==============================================================================
Submit Normal Job                                                     ......
 Submit Normal Job - CREAM 

Submit Normal Job                                                     | PASS |
------------------------------------------------------------------------------
Submit Bulk of Jobs                                                   ......
 Submit Bulk of Jobs - CREAM 

Submit Bulk of Jobs                                                   | FAIL |
[u"Submit Bulk of Jobs - CREAM : GeneralError: 'Job finishes with status: Aborted cannot retrieve output'"]
------------------------------------------------------------------------------
Submit Parametric Job                                                 ......
 Submit Parametric Job - CREAM 

Submit Parametric Job                                                 | FAIL |
[u"Submit Parametric Job - CREAM : GeneralError: 'Job finishes with status: Aborted cannot retrieve output'"]
------------------------------------------------------------------------------
Submit DAG Job                                                        | FAIL |
GeneralError: 'Job finishes with status: Aborted cannot retrieve the output'
------------------------------------------------------------------------------
Submit MPI Job                                                        ......
 Submit MPI Job - CREAM 

Submit MPI Job                                                        | PASS |
------------------------------------------------------------------------------
Submit Perusal Job                                                    ....
 Submit Perusal Job - CREAM 

Submit Perusal Job                                                    | FAIL |
[u"Submit Perusal Job - CREAM : RunCommandError: u'Command glite-wms-job-perusal --get -f out.txt --dir /home/capannini/certificazione/WMSTaskIGIRTC175/WMSService-WMS-job-cycle_20140321105352/jobOutput https://emitestbed44.cnaf.infn.it:9000/EwI8DDxAg-f1pAnpqIQWDg failed. Failure message: \\nConnecting to the service https://emitestbed44.cnaf.infn.it:7443/glite_wms_wmproxy_server\\n\\n\\nError - WMProxy Server Error\\nProxy exception: Unable to get Not Before date from proxy\\nError code: SOAP-ENV:Server\\n\\n'"]
------------------------------------------------------------------------------
Submit Bulk of Jobs , using a single jdl with all jdls of nodes       ......
 Submit Bulk of Jobs , using a single jdl with all jdls of nodes - CREAM 

Submit Bulk of Jobs , using a single jdl with all jdls of nodes       | PASS |
------------------------------------------------------------------------------
Testing forwarding parameters for parallel jobs                       ....
 Case1 


 Case 2 


 Case 3 


 Case 4 


 Case 5 

Testing forwarding parameters for parallel jobs                       | PASS |
------------------------------------------------------------------------------
WMS-job-cycle :: WMS Job Cycle Test Suite                             | FAIL |
8 critical tests, 4 passed, 4 failed
8 tests total, 4 passed, 4 failed
==============================================================================
Output:  /home/capannini/certificazione/WMSTaskIGIRTC175/output.xml
Log:     /home/capannini/certificazione/WMSTaskIGIRTC175/log.html
Report:  /home/capannini/certificazione/WMSTaskIGIRTC175/report.html

Jdl attributes - SOME FAILURES

[capannini@emitestbed54 WMSTaskIGIRTC175]$ pybot ~/git/WMS-Test-Suite/robot_testsuites/wms_tests/testsuites/WMS-service/WMS-jdl-attributes-job-cycle.html
==============================================================================
WMS-jdl-attributes-job-cycle :: WMS Job Cycle Test Suite                      
==============================================================================
Jdl with AllowZippedISB                                               ....
 Jdl with AllowZippedISB - CREAM 

Jdl with AllowZippedISB                                               | FAIL |
Message 'Archiving the ISB files' not found: '-----------------------------------------
21 March 2014, 11:50:51 -I- PID: 14410 (Debug) - Vo read from proxy certificate extension
-----------------------------------------
-----------------------------------------
21 March 2014, 11:50:51 -I- PID: 14410 (Debug) - VirtualOrganisation value : testers.eu-emi.eu
-----------------------------------------
-----------------------------------------
21 March 2014, 11:50:51 -I- PID: 14410 (Debug) - Loaded user configuration file:
 /home/capannini/certificazione/WMSTaskIGIRTC175/WMSService-WMS-jdl-attributes-job-cycle_20140321115051/wms.conf
-----------------------------------------
-----------------------------------------
21 March 2014, 11:50:51 -I- PID: 14410 (Debug) - Configuration file: //etc/glite-wms/testers.eu-emi.eu/glite_wmsui.conf - VirtualOrganisation, MyProxyServer attribute(s) no more supported outside JDL Default Attributes section "JdlDefaultAttributes"
    [ Message content over the limit has been removed. ]
...014, 11:50:53 -I- PID: 14410 (Debug) - Calling the WMProxy jobStart service
-----------------------------------------
-----------------------------------------
21 March 2014, 11:50:53 -I- PID: 14410 (Debug) - jobStart -  The job has been successfully started
-----------------------------------------

====================== glite-wms-job-submit Success ======================

The job has been successfully submitted to the WMProxy
Your job identifier is:

https://emitestbed44.cnaf.infn.it:9000/_L8EcmTAtUsVtqqOqmViAQ

==========================================================================

      *** Log file created ***
Possible Errors and Debug messages have been printed in the following file:
/tmp/glite-wms-job-submit_501_14410_20140321_11-50-51.log
' does not contain 'Archiving the ISB files'
------------------------------------------------------------------------------
Jdl with ExpiryTime                                                   | PASS |
------------------------------------------------------------------------------
Jdl with ShortDeadlineJob                                             ......
 Jdl with ShortDeadlineJob - CREAM 

Jdl with ShortDeadlineJob                                             | FAIL |
[u'CREAM : No Computing Element matching your job requirements has been found']
------------------------------------------------------------------------------
Jdl with DataRequirements                                             | FAIL |
RunCommandError: u'Command lfc-mkdir /grid/testers.eu-emi.eu/20140321115051 failed. Failure message: send2nsd: NS009 - fatal configuration error: Host unknown: emi2rc-sl5-lfc.cern.ch\ncannot create /grid/testers.eu-emi.eu/20140321115051: Host not known'
------------------------------------------------------------------------------
Jdl with InputSandboxBaseURI                                          ....    
 Jdl with InputSandboxBaseURI - CREAM 

Jdl with InputSandboxBaseURI                                          | PASS |
------------------------------------------------------------------------------
Jdl with OutputSandboxBaseDestURI                                     ...     
 Jdl with OutputSandboxBaseDestURI - CREAM 

Jdl with OutputSandboxBaseDestURI                                     | PASS |
------------------------------------------------------------------------------
Jdl with OutputSandboxDestURI                                         ...     
 Jdl with OutputSandboxDestURI - CREAM 

Jdl with OutputSandboxDestURI                                         | PASS |
------------------------------------------------------------------------------
Jdl with FuzzyRank attribute                                          ......
 Jdl with FuzzyRank attribute - CREAM 

Jdl with FuzzyRank attribute                                          | PASS |
------------------------------------------------------------------------------
Jdl with UserTags attribute                                           ......
 Jdl with UserTags attribute - CREAM 

Jdl with UserTags attribute                                           | PASS |
------------------------------------------------------------------------------
Jdl with LBAddresses attribute                                        .......
 Jdl with LBAddresses attribute - CREAM 

Jdl with LBAddresses attribute                                        | PASS |
------------------------------------------------------------------------------
Jdl with Environment attribute                                        ......
 Jdl with Environment attribute - CREAM 

Jdl with Environment attribute                                        | PASS |
------------------------------------------------------------------------------
Jdl with PerusalFileEnable attribute                                  ......
 Jdl with PerusalFileEnable attribute - CREAM 

Jdl with PerusalFileEnable attribute                                  | PASS |
------------------------------------------------------------------------------
Jdl with PerusalTimeInterval attribute                                ......
 Jdl with PerusalTimeInterval attribute - CREAM 

Jdl with PerusalTimeInterval attribute                                | FAIL |
[u"Jdl with PerusalTimeInterval attribute - CREAM : RunCommandError: u'Command glite-wms-job-perusal --get -f out.txt --dir /home/capannini/certificazione/WMSTaskIGIRTC175/WMSService-WMS-jdl-attributes-job-cycle_20140321115051/jobOutput https://emitestbed44.cnaf.infn.it:9000/BL3JtI8lI4LTAKof20sn5Q failed. Failure message: \\nConnecting to the service https://emitestbed44.cnaf.infn.it:7443/glite_wms_wmproxy_server\\n\\n\\nError - WMProxy Server Error\\nProxy exception: Unable to get Not Before date from proxy\\nError code: SOAP-ENV:Server\\n\\n'"]
------------------------------------------------------------------------------
WMS-jdl-attributes-job-cycle :: WMS Job Cycle Test Suite              | FAIL |
13 critical tests, 9 passed, 4 failed
13 tests total, 9 passed, 4 failed
==============================================================================
Output:  /home/capannini/certificazione/WMSTaskIGIRTC175/output.xml
Log:     /home/capannini/certificazione/WMSTaskIGIRTC175/log.html
Report:  /home/capannini/certificazione/WMSTaskIGIRTC175/report.html
* jdl.tgz: jdl.tgz

Jdl compund job - SOME FAILURES

[capannini@emitestbed54 WMSTaskIGIRTC175]$ pybot ~/git/WMS-Test-Suite/robot_testsuites/wms_tests/testsuites/WMS-service/WMS-jdl-attributes-coumpound-jobs-cycle.html
==============================================================================
WMS-jdl-attributes-coumpound-jobs-cycle :: WMS Jdl Attributes Coumpound Job...
==============================================================================
Check job cycle using DAG job with jdl that contains other DAG        ....
 Check job cycle using DAG job with jdl that contains other DAG - CREAM 

Check job cycle using DAG job with jdl that contains other DAG        | FAIL |
[u"Check job cycle using DAG job with jdl that contains other DAG - CREAM : GeneralError: 'This test is not yet implemented'"]
------------------------------------------------------------------------------
Check job cycle using DAG job and jdl with DefaultNodeRetryCount a... ....
 Check job cycle using DAG job and jdl with DefaultNodeRetryCount attribute - CREAM 

Check job cycle using DAG job and jdl with DefaultNodeRetryCount a... | FAIL |
[u'Check job cycle using DAG job and jdl with DefaultNodeRetryCount attribute - CREAM : GeneralError: "Coumpound job https://emitestbed44.cnaf.infn.it:9000/sk0ReZKt51PWryzZwajaJQ hasn\'t be correctly resubmitted"']
------------------------------------------------------------------------------
Check job cycle using jobs collection and jdl with DefaultNodeRetr... ....
 Check job cycle using jobs collection and jdl with DefaultNodeRetryCount attribute - CREAM 

Check job cycle using jobs collection and jdl with DefaultNodeRetr... | FAIL |
[u'Check job cycle using jobs collection and jdl with DefaultNodeRetryCount attribute - CREAM : GeneralError: "Problem , coumpound job\'s final status is Cleared"']
------------------------------------------------------------------------------
Check job cycle using DAG job and jdl with DefaultNodeShallowRetry... ....
 Check job cycle using DAG job and jdl with DefaultNodeShallowRetryCount attribute - CREAM 

Check job cycle using DAG job and jdl with DefaultNodeShallowRetry... | FAIL |
[u'Check job cycle using DAG job and jdl with DefaultNodeShallowRetryCount attribute - CREAM : RunCommandError: \'Command glite-wms-job-logging-info --event RESUBMISSION https://emitestbed44.cnaf.infn.it:9000/HGgIcCYTFvmZf5RFYNTCKA failed. Failure message: **** Warning: API_NATIVE_ERROR ****  \\nError while calling the "Eve::queryEvents" native api \\nUnable to retrieve any status information from: emitestbed44.cnaf.infn.it: glite.lb.Exception: edg_wll_QueryEvents: No such file or directory: no matching events found\\n\\tat glite::lb::ServerConnection::queryEvents[./src/ServerConnection.cpp:848]\\n\\n\\n**** Warning: API_NATIVE_ERROR ****  \\nError while calling the "Eve::queryEvents" native api \\nUnable to retrieve any matching information for jobid: https://emitestbed44.cnaf.infn.it:9000/HGgIcCYTFvmZf5RFYNTCKA\\n\\n\'']
------------------------------------------------------------------------------
Check job cycle using jobs collection and jdl with DefaultNodeShal... ....
 Check job cycle using jobs collection and jdl with DefaultNodeShallowRetryCount attribute - CREAM 

Check job cycle using jobs collection and jdl with DefaultNodeShal... | FAIL |
[u"Check job cycle using jobs collection and jdl with DefaultNodeShallowRetryCount attribute - CREAM : GeneralError: 'Problem , jobs final status is Cleared'"]
------------------------------------------------------------------------------
Check job cycle using DAG job and jdl with AllowZippedISB attribute   ....
 Check job cycle using DAG job and jdl with AllowZippedISB attribute - CREAM 

Check job cycle using DAG job and jdl with AllowZippedISB attribute   | FAIL |
[u"Check job cycle using DAG job and jdl with AllowZippedISB attribute - CREAM : GeneralError: 'Message Archiving the ISB files not found'"]
------------------------------------------------------------------------------
Check job cycle using jobs collection and jdl with AllowZippedISB ... ....
 Check job cycle using jobs collection and jdl with AllowZippedISB attribute - CREAM 

Check job cycle using jobs collection and jdl with AllowZippedISB ... | FAIL |
[u"Check job cycle using jobs collection and jdl with AllowZippedISB attribute - CREAM : GeneralError: 'Message Archiving the ISB files not found'"]
------------------------------------------------------------------------------
Check job cycle using DAG job and jdl with UserTags attribute         ....
 Check job cycle using DAG job and jdl with UserTags attribute - CREAM 

Check job cycle using DAG job and jdl with UserTags attribute         | FAIL |
[u"Check job cycle using DAG job and jdl with UserTags attribute - CREAM : GeneralError: 'Job finishes with status: Aborted cannot retrieve output'"]
------------------------------------------------------------------------------
Check job cycle using jobs collection and jdl with UserTags attribute ....
 Check job cycle using jobs collection and jdl with UserTags attribute - CREAM 

Check job cycle using jobs collection and jdl with UserTags attribute | FAIL |
[u"Check job cycle using jobs collection and jdl with UserTags attribute - CREAM : GeneralError: 'Job finishes with status: Cleared cannot retrieve output'"]
------------------------------------------------------------------------------
Check job cycle using DAG job and jdl with ExpiryTime attribute       ....
 Check job cycle using DAG job and jdl with ExpiryTime attribute - CREAM 

Check job cycle using DAG job and jdl with ExpiryTime attribute       | FAIL |
[u"Check job cycle using DAG job and jdl with ExpiryTime attribute - CREAM : TimeOutError: 'Timeout reached while waiting the job https://emitestbed44.cnaf.infn.it:9000/Vq2y7RQ4IvSiply6HDA7fA to finish'"]
------------------------------------------------------------------------------
Check job cycle using jobs collection and jdl with ExpiryTime attr... ....
 Check job cycle using jobs collection and jdl with ExpiryTime attribute - CREAM 

Check job cycle using jobs collection and jdl with ExpiryTime attr... | FAIL |
[u"Check job cycle using jobs collection and jdl with ExpiryTime attribute - CREAM : TimeOutError: 'Timeout reached while waiting the job https://emitestbed44.cnaf.infn.it:9000/IAEHY4Qw-dLzxVCIn4TRFg to finish'"]
------------------------------------------------------------------------------
WMS-jdl-attributes-coumpound-jobs-cycle :: WMS Jdl Attributes Coum... | FAIL |
11 critical tests, 0 passed, 11 failed
11 tests total, 0 passed, 11 failed
==============================================================================
Output:  /home/capannini/certificazione/WMSTaskIGIRTC175/output.xml
Log:     /home/capannini/certificazione/WMSTaskIGIRTC175/log.html
Report:  /home/capannini/certificazione/WMSTaskIGIRTC175/report.html

Job resubmission - SOME FAILURES

[capannini@emitestbed54 WMSTaskIGIRTC175]$ pybot ~/git/WMS-Test-Suite/robot_testsuites/wms_tests/testsuites/WMS-service/WMS-job-resubmit.html
==============================================================================
WMS-job-resubmit :: WMS Job Resubmit Test Suite                               
==============================================================================
Shallow Resubmission                                                  ....
 Shallow Resubmission - CREAM 

Shallow Resubmission                                                  | PASS |
------------------------------------------------------------------------------
Deep Resubmission                                                     ....
 Deep Resubmission - CREAM 

Deep Resubmission                                                     | FAIL |
[u'Deep Resubmission - CREAM : Job aborted fon an unexpected reason: hit job shallow retry count (0): hit job shallow retry count (0) != hit job retry count (2)']
------------------------------------------------------------------------------
WMS-job-resubmit :: WMS Job Resubmit Test Suite                       | FAIL |
2 critical tests, 1 passed, 1 failed
2 tests total, 1 passed, 1 failed
==============================================================================
Output:  /home/capannini/certificazione/WMSTaskIGIRTC175/output.xml
Log:     /home/capannini/certificazione/WMSTaskIGIRTC175/log.html
Report:  /home/capannini/certificazione/WMSTaskIGIRTC175/report.html

Limiter mechanism - FAILED

[capannini@emitestbed54 WMSTaskIGIRTC175]$ pybot ~/git/WMS-Test-Suite/robot_testsuites/wms_tests/testsuites/WMS-service/WMS-limiter-mechanism.html
==============================================================================
WMS-limiter-mechanism :: Test the WMS limiter mechanism operation             
==============================================================================
Test Option load1                                                     | FAIL |
Method isn't jobSubmit as expected: '' does not contain 'jobSubmit'
------------------------------------------------------------------------------
Test Option load5                                                     | FAIL |
Method isn't jobSubmit as expected: '' does not contain 'jobSubmit'
------------------------------------------------------------------------------
Test Option load15                                                    | FAIL |
Submission not failed as expected
------------------------------------------------------------------------------
Test Option memusage                                                  | FAIL |
Method isn't jobSubmit as expected: '' does not contain 'jobSubmit'
------------------------------------------------------------------------------
Test Option swapusage                                                 | FAIL |
Submission not failed as expected
------------------------------------------------------------------------------
Test Option ftpconn                                                   | FAIL |
Method isn't jobSubmit as expected: '' does not contain 'jobSubmit'
------------------------------------------------------------------------------
Test Option diskusage                                                 | FAIL |
Method isn't jobSubmit as expected: '' does not contain 'jobSubmit'
------------------------------------------------------------------------------
Test Option fdnum                                                     | FAIL |
Method isn't jobSubmit as expected: '' does not contain 'jobSubmit'
------------------------------------------------------------------------------
Test Option jdnum                                                     | FAIL |
Submission not failed as expected
------------------------------------------------------------------------------
Test Option jdsize                                                    | FAIL |
Submission not failed as expected
------------------------------------------------------------------------------
WMS-limiter-mechanism :: Test the WMS limiter mechanism operation     | FAIL |
10 critical tests, 0 passed, 10 failed
10 tests total, 0 passed, 10 failed
==============================================================================
Output:  /home/capannini/certificazione/WMSTaskIGIRTC175/output.xml
Log:     /home/capannini/certificazione/WMSTaskIGIRTC175/log.html
Report:  /home/capannini/certificazione/WMSTaskIGIRTC175/report.html

Listmatch - PASSED

[capannini@emitestbed54 WMSTaskIGIRTC175]$ pybot ~/git/WMS-Test-Suite/robot_testsuites/wms_tests/testsuites/WMS-service/WMS-list-match.html
==============================================================================
WMS-list-match :: WMS list match testing suite.                               
==============================================================================
Check Executables                                                     | PASS |
------------------------------------------------------------------------------
Simple Matching                                                       | PASS |
------------------------------------------------------------------------------
Delegation Matching                                                   | PASS |
------------------------------------------------------------------------------
Exclude CE from Match                                                 | PASS |
------------------------------------------------------------------------------
Failure Matching                                                      | PASS |
------------------------------------------------------------------------------
Matching (EnableWMSFeedback True)                                     | PASS |
------------------------------------------------------------------------------
WMS-list-match :: WMS list match testing suite.                       | PASS |
6 critical tests, 6 passed, 0 failed
6 tests total, 6 passed, 0 failed
==============================================================================
Output:  /home/capannini/certificazione/WMSTaskIGIRTC175/output.xml
Log:     /home/capannini/certificazione/WMSTaskIGIRTC175/log.html
Report:  /home/capannini/certificazione/WMSTaskIGIRTC175/report.html

Prologue/epilogue - PASSED

[capannini@emitestbed54 WMSTaskIGIRTC175]$ pybot ~/git/WMS-Test-Suite/robot_testsuites/wms_tests/testsuites/WMS-service/WMS-prologue-epilogue.html
==============================================================================
WMS-prologue-epilogue :: WMS Prologue Epilogue Test Suite                     
==============================================================================
Prologue                                                              ....
 Prologue - CREAM 

Prologue                                                              | PASS |
------------------------------------------------------------------------------
Epilogue                                                              ....
 Epilogue - CREAM 

Epilogue                                                              | PASS |
------------------------------------------------------------------------------
Prologue and Epilogue                                                 ....
 Prologue and Epilogue - CREAM 

Prologue and Epilogue                                                 | PASS |
------------------------------------------------------------------------------
WMS-prologue-epilogue :: WMS Prologue Epilogue Test Suite             | PASS |
3 critical tests, 3 passed, 0 failed
3 tests total, 3 passed, 0 failed
==============================================================================
Output:  /home/capannini/certificazione/WMSTaskIGIRTC175/output.xml
Log:     /home/capannini/certificazione/WMSTaskIGIRTC175/log.html
Report:  /home/capannini/certificazione/WMSTaskIGIRTC175/report.html

Proxy renewal - PASSED

[capannini@emitestbed54 WMSTaskIGIRTC175]$ myproxy-init -s myproxy.cnaf.infn.it -d -n
Your identity: /C=IT/O=INFN/OU=Personal Certificate/L=CNAF/CN=Fabio Capannini
Enter GRID pass phrase for this identity:
Creating proxy ..................................................................................................... Done
Proxy Verify OK
Your proxy is valid until: Wed Apr  2 12:01:53 2014
A proxy valid for 168 hours (7.0 days) for user /C=IT/O=INFN/OU=Personal Certificate/L=CNAF/CN=Fabio Capannini now exists on myproxy.cnaf.infn.it.
[root@emitestbed44 ~]# rm -rf /var/ice/persist_dir/*
[root@emitestbed44 ~]# rm -f /var/glite/spool/glite-renewd/*
[root@emitestbed44 ~]# /etc/init.d/glite-wms-ice restart
stopping ICE... ok
starting ICE... ok

[capannini@emitestbed54 WMSTaskIGIRTC175]$ pybot ~/git/WMS-Test-Suite/robot_testsuites/wms_tests/testsuites/WMS-service/WMS-proxy-renewal.html
==============================================================================
WMS-proxy-renewal :: WMS Proxy Renewal Test Suite                             
==============================================================================
Proxy renewal                                                         ....
 Proxy renewal - CREAM 

Proxy renewal                                                         | PASS |
------------------------------------------------------------------------------
Proxy renewal without setting MYPROXYSERVER                           ....
 Proxy renewal without setting MYPROXYSERVER - CREAM 

Proxy renewal without setting MYPROXYSERVER                           | PASS |
------------------------------------------------------------------------------
WMS-proxy-renewal :: WMS Proxy Renewal Test Suite                     | PASS |
2 critical tests, 2 passed, 0 failed
2 tests total, 2 passed, 0 failed
==============================================================================
Output:  /home/capannini/certificazione/WMSTaskIGIRTC175/output.xml
Log:     /home/capannini/certificazione/WMSTaskIGIRTC175/log.html
Report:  /home/capannini/certificazione/WMSTaskIGIRTC175/report.html

Purger - PASSED

[capannini@emitestbed54 WMSTaskIGIRTC175]$ pybot -e case1 -e case6 -e case7 ~/git/WMS-Test-Suite/robot_testsuites/wms_tests/testsuites/WMS-service/WMS-check-purger.html
==============================================================================
WMS-check-purger :: WMS Check Purger Test Suite                               
==============================================================================
Test purge , normal job cycle ( Submit to CREAM CE )                  | PASS |
------------------------------------------------------------------------------
Test proxy cache purging                                              | PASS |
------------------------------------------------------------------------------
SandBoxDir cron purger ( Submit a job and force its purge before i... | PASS |
------------------------------------------------------------------------------
SandBoxDir cron purger ( Purge a DONE job )                           | PASS |
------------------------------------------------------------------------------
SandBoxDir cron purger ( Purge a DAG job )                            | PASS |
------------------------------------------------------------------------------
WMS-check-purger :: WMS Check Purger Test Suite                       | PASS |
5 critical tests, 5 passed, 0 failed
5 tests total, 5 passed, 0 failed
==============================================================================
Output:  /home/capannini/certificazione/WMSTaskIGIRTC175/output.xml
Log:     /home/capannini/certificazione/WMSTaskIGIRTC175/log.html
Report:  /home/capannini/certificazione/WMSTaskIGIRTC175/report.html

Configuration - SOME FAILURES

[capannini@emitestbed54 WMSTaskIGIRTC175]$ pybot ~/git/WMS-Test-Suite/robot_testsuites/wms_tests/testsuites/WMS-service/WMS-check-configuration-3.4.html
==============================================================================
WMS-check-configuration-3.4 :: Check the syntax of the WMS configuration fi...
==============================================================================
Check Common Section                                                  | PASS |
------------------------------------------------------------------------------
Check JobController Section                                           | PASS |
------------------------------------------------------------------------------
Check NetworkServer Section                                           | PASS |
------------------------------------------------------------------------------
Check LogMonitor Section                                              | PASS |
------------------------------------------------------------------------------
Check WorkloadManager Section                                         | FAIL |
GeneralError: u'Section: WorkloadManager , problem with following attributes: set([\'IsmThreads  =  true;\', \'IsmIiLDAPCEFilterExt  =  "(|(GlueCEAccessControlBaseRule=VO:testers.eu-emi.eu)(GlueCEAccessControlBaseRule=VOMS:/testers.eu-emi.eu/*)(GlueCEAccessControlBaseRule=VO:testers2.eu-emi.eu)(GlueCEAccessControlBaseRule=VOMS:/testers2.eu-emi.eu/*)(GlueCEAccessControlBaseRule=VO:testers3.eu-emi.eu)(GlueCEAccessControlBaseRule=VOMS:/testers3.eu-emi.eu/*)(GlueCEAccessControlBaseRule=VO:dteam)(GlueCEAccessControlBaseRule=VOMS:/dteam/*)(GlueCEAccessControlBaseRule=VO:infngrid)(GlueCEAccessControlBaseRule=VOMS:/infngrid/*))";\', \'IsmThreads  =  false;\', \'IsmIiLDAPCEFilterExt  =  "(|(GlueCEAccessControlBaseRule=VO:testers.eu-emi.eu)(GlueCEAccessControlBaseRule=VOMS:/testers.eu-emi.eu/*)(GlueCEAccessControlBaseRule=VO:testers2.eu-emi.eu)(GlueCEAccessControlBaseRule=VOMS:/testers2.eu-emi.eu/*)(GlueCEAccessControlBaseRule=VO:cms)(GlueCEAccessControlBaseRule=VOMS:/cms/*)(GlueCEAccessControlBaseRule=VO:dteam)(GlueCEAccessControlBaseRule=VOMS:/dteam/*)(GlueCEAccessControlBaseRule=VO:infngrid)(GlueCEAccessControlBaseRule=VOMS:/infngrid/*))";\'])'
------------------------------------------------------------------------------
Check WorkloadManagerProxy Section                                    | FAIL |
GeneralError: u'Section: WorkloadManagerProxy , problem with following attributes: set([\'AsyncJobStart  =  true;\', \'AsyncJobStart  =  false;\', \'Wms_Pepc_ResourceId  =  "https://emitestbed44.cnaf.infn.it:7443/glite_wms_wmproxy_server";\'])'
------------------------------------------------------------------------------
Check ICE Section                                                     | FAIL |
GeneralError: u"Section: ICE , problem with following attributes: set(['proxy_renewal_timeout  =  120;', 'ice_log_level   =   500;', 'ice_log_level   =   300;'])"
------------------------------------------------------------------------------
Check Variables                                                       | FAIL |
This test requires the YAIM_FILE configuration file. Please set the YAIM_FILE variable in the test's configuration file.
------------------------------------------------------------------------------
WMS-check-configuration-3.4 :: Check the syntax of the WMS configu... | FAIL |
8 critical tests, 4 passed, 4 failed
8 tests total, 4 passed, 4 failed
==============================================================================
Output:  /home/capannini/certificazione/WMSTaskIGIRTC175/output.xml
Log:     /home/capannini/certificazione/WMSTaskIGIRTC175/log.html
Report:  /home/capannini/certificazione/WMSTaskIGIRTC175/report.html

Delegation SOME FAILURES

[capannini@emitestbed54 WMSTaskIGIRTC175]$ pybot ~/git/WMS-Test-Suite/robot_testsuites/wms_tests/testsuites/WMS-service/WMS-delegation.html
==============================================================================
WMS-delegation :: WMS Delegation Test Suite                                   
==============================================================================
Check --autm-delegation option                                        | PASS |
------------------------------------------------------------------------------
Check --delegationid option                                           | PASS |
------------------------------------------------------------------------------
Try to delegate with a short proxy                                    | PASS |
------------------------------------------------------------------------------
Works with expired proxy                                              | FAIL |
RunCommandError: u'Command glite-wms-job-info --config /home/capannini/certificazione/WMSTaskIGIRTC175/WMSService-WMS-delegation_20140326115655/wms.conf -d deleg-1395831431 failed. Failure message: \nConnecting to the service https://emitestbed44.cnaf.infn.it:7443/glite_wms_wmproxy_server\n\n\nError - WMProxy Server Error\nProxy exception: the proxy has expired\nError code: SOAP-ENV:Server\n\n'
------------------------------------------------------------------------------
Works with long chain proxies (ggus ticket 79096)                     | FAIL |
GeneralError: 'Failed to create a valid user proxy'
------------------------------------------------------------------------------
WMS-delegation :: WMS Delegation Test Suite                           | FAIL |
5 critical tests, 3 passed, 2 failed
5 tests total, 3 passed, 2 failed
==============================================================================
Output:  /home/capannini/certificazione/WMSTaskIGIRTC175/output.xml
Log:     /home/capannini/certificazione/WMSTaskIGIRTC175/log.html
Report:  /home/capannini/certificazione/WMSTaskIGIRTC175/report.html

Feedback - PASSED

[capannini@emitestbed54 WMSTaskIGIRTC175]$ pybot ~/git/WMS-Test-Suite/robot_testsuites/wms_tests/testsuites/WMS-service/WMS-feedback-test.html
==============================================================================
WMS-feedback-test :: Test the WMS limiter mechanism operation                 
==============================================================================
Test WMS feedback feature                                             | PASS |
------------------------------------------------------------------------------
WMS-feedback-test :: Test the WMS limiter mechanism operation         | PASS |
1 critical test, 1 passed, 0 failed
1 test total, 1 passed, 0 failed
==============================================================================
Output:  /home/capannini/certificazione/WMSTaskIGIRTC175/output.xml
Log:     /home/capannini/certificazione/WMSTaskIGIRTC175/log.html
Report:  /home/capannini/certificazione/WMSTaskIGIRTC175/report.html
</feedback>
   * [[%ATTACHURL%/feed.tgz][feed.tgz]]: feed.tgz

-- Main.FabioCapannini - 2014-03-20


   














Topic attachments
I Attachment Action SizeSorted ascending Date Who Comment
Compressed Zip archivetgz conf.tgz manage 115.6 K 2014-03-26 - 10:56 FabioCapannini  
Compressed Zip archivetgz listmatch.tgz manage 117.7 K 2014-03-24 - 10:27 FabioCapannini  
Compressed Zip archivetgz resub.tgz manage 124.0 K 2014-03-21 - 16:32 FabioCapannini  
Compressed Zip archivetgz deleg.tgz manage 125.0 K 2014-03-26 - 11:09 FabioCapannini  
Compressed Zip archivetgz feed.tgz manage 125.3 K 2014-03-26 - 13:43 FabioCapannini  
Compressed Zip archivetgz prologue.tgz manage 128.0 K 2014-03-24 - 16:11 FabioCapannini  
Compressed Zip archivetgz renew.tgz manage 132.3 K 2014-03-26 - 10:37 FabioCapannini  
Compressed Zip archivetgz purge.tgz manage 134.2 K 2014-03-26 - 10:53 FabioCapannini  
Compressed Zip archivetgz limiter.tgz manage 135.8 K 2014-03-24 - 10:24 FabioCapannini  
Compressed Zip archivetgz jdl.tgz manage 176.8 K 2014-03-21 - 11:46 FabioCapannini  
Compressed Zip archivetgz cycle.tgz manage 183.2 K 2014-03-21 - 10:50 FabioCapannini  
Compressed Zip archivetgz compound.tgz manage 211.4 K 2014-03-21 - 15:37 FabioCapannini  
Edit | Attach | PDF | History: r11 | r9 < r8 < r7 < r6 | Backlinks | Raw View | More topic actions...
Topic revision: r7 - 2014-03-26 - FabioCapannini
 
  • Edit
  • Attach
This site is powered by the TWiki collaboration platformCopyright © 2008-2019 by the contributing authors. All material on this collaboration platform is the property of the contributing authors.
Ideas, requests, problems regarding TWiki? Send feedback