Tags:
, view all tags

WMS 3.6.6 Test Report - IGIRTC-189

Deployment tests

Testing SL5 - PASSED

  • WMS 3.6.6 SL5 test reports
    • Install packages - LOG
    • Update packages - LOG

Testing SL6 - PASSED

  • WMS 3.6.6 SL6 test reports

Functionality tests

Job submission - SOME FAILURES

[capannini@emitestbed54 WMSTaskIGIRTC189]$ pybot ~/git/WMS-Test-Suite/robot_testsuites/wms_tests/testsuites/WMS-service/WMS-job-cycle.html
==============================================================================
WMS-job-cycle :: WMS Job Cycle Test Suite                                     
==============================================================================
Submit Normal Job                                                     ......
 Submit Normal Job - CREAM 

Submit Normal Job                                                     | PASS |
------------------------------------------------------------------------------
Submit Bulk of Jobs                                                   ......
 Submit Bulk of Jobs - CREAM 

Submit Bulk of Jobs                                                   | FAIL |
[u"Submit Bulk of Jobs - CREAM : TimeOutError: 'Timeout reached while waiting the job https://emitestbed44.cnaf.infn.it:9000/lpgKpFwNWW5NPRTmZq7vmQ to finish'"]
------------------------------------------------------------------------------
Submit Parametric Job                                                 ......
 Submit Parametric Job - CREAM 

Submit Parametric Job                                                 | PASS |
------------------------------------------------------------------------------
Submit DAG Job                                                        | FAIL |
TimeOutError: 'Timeout reached while waiting the job https://emitestbed44.cnaf.infn.it:9000/86jmL1ZvpEdkvZ4VE8ZZ2w to finish'
------------------------------------------------------------------------------
Submit MPI Job                                                        ......
 Submit MPI Job - CREAM 

Submit MPI Job                                                        | PASS |
------------------------------------------------------------------------------
Submit Perusal Job                                                    ....
 Submit Perusal Job - CREAM 

Submit Perusal Job                                                    | PASS |
------------------------------------------------------------------------------
Submit Bulk of Jobs , using a single jdl with all jdls of nodes       ......
 Submit Bulk of Jobs , using a single jdl with all jdls of nodes - CREAM 

Submit Bulk of Jobs , using a single jdl with all jdls of nodes       | FAIL |
[u"Submit Bulk of Jobs , using a single jdl with all jdls of nodes - CREAM : TimeOutError: 'Timeout reached while waiting the job https://emitestbed44.cnaf.infn.it:9000/3qnY5aOcRO8a0I-Z3mI4iw to finish'"]
------------------------------------------------------------------------------
Testing forwarding parameters for parallel jobs                       ....
 Case1 


 Case 2 


 Case 3 


 Case 4 


 Case 5 

Testing forwarding parameters for parallel jobs                       | PASS |
------------------------------------------------------------------------------
WMS-job-cycle :: WMS Job Cycle Test Suite                             | FAIL |
8 critical tests, 5 passed, 3 failed
8 tests total, 5 passed, 3 failed
==============================================================================
Output:  /home/capannini/certificazione/WMSTaskIGIRTC189/output.xml
Log:     /home/capannini/certificazione/WMSTaskIGIRTC189/log.html
Report:  /home/capannini/certificazione/WMSTaskIGIRTC189/report.html

Jdl attributes - SOME FAILURES

[capannini@emitestbed54 WMSTaskIGIRTC189]$ pybot ~/git/WMS-Test-Suite/robot_testsuites/wms_tests/testsuites/WMS-service/WMS-jdl-attributes-job-cycle.html
==============================================================================
WMS-jdl-attributes-job-cycle :: WMS Job Cycle Test Suite                      
==============================================================================
Jdl with AllowZippedISB                                               ....
 Jdl with AllowZippedISB - CREAM 

Jdl with AllowZippedISB                                               | FAIL |
Message 'Archiving the ISB files' not found: '-----------------------------------------
28 Aug 2014, 09:52:00 -I- PID: 25516 (Debug) - Vo read from proxy certificate extension
-----------------------------------------
-----------------------------------------
28 Aug 2014, 09:52:00 -I- PID: 25516 (Debug) - VirtualOrganisation value : testers.eu-emi.eu
-----------------------------------------
-----------------------------------------
28 Aug 2014, 09:52:00 -I- PID: 25516 (Debug) - Loaded user configuration file:
 /home/capannini/certificazione/WMSTaskIGIRTC189/WMSService-WMS-jdl-attributes-job-cycle_20140828095200/wms.conf
-----------------------------------------
-----------------------------------------
28 Aug 2014, 09:52:00 -I- PID: 25516 (Debug) - Configuration file: //etc/glite-wms/testers.eu-emi.eu/glite_wmsui.conf - VirtualOrganisation, MyProxyServer attribute(s) no more supported outside JDL Default Attributes section "JdlDefaultAttributes"
-----------------------------------------
    [ Message content over the limit has been removed. ]
...014, 09:52:02 -I- PID: 25516 (Debug) - Calling the WMProxy jobStart service
-----------------------------------------
-----------------------------------------
28 Aug 2014, 09:52:02 -I- PID: 25516 (Debug) - jobStart -  The job has been successfully started
-----------------------------------------

====================== glite-wms-job-submit Success ======================

The job has been successfully submitted to the WMProxy
Your job identifier is:

https://emitestbed44.cnaf.infn.it:9000/ThU5XsouMTrKolAY6uKw2w

==========================================================================

      *** Log file created ***
Possible Errors and Debug messages have been printed in the following file:
/tmp/glite-wms-job-submit_501_25516_20140828_09-52-00.log
' does not contain 'Archiving the ISB files'
------------------------------------------------------------------------------
Jdl with ExpiryTime                                                   | PASS |
------------------------------------------------------------------------------
Jdl with ShortDeadlineJob                                             ......
 Jdl with ShortDeadlineJob - CREAM 

Jdl with ShortDeadlineJob                                             | FAIL |
[u'CREAM : No Computing Element matching your job requirements has been found']
------------------------------------------------------------------------------
Jdl with DataRequirements                                             | FAIL |
RunCommandError: u'Command lfc-mkdir /grid/testers.eu-emi.eu/20140828095200 failed. Failure message: send2nsd: NS009 - fatal configuration error: Host unknown: emi2rc-sl5-lfc.cern.ch\ncannot create /grid/testers.eu-emi.eu/20140828095200: Host not known'
------------------------------------------------------------------------------
Jdl with InputSandboxBaseURI                                          ....    
 Jdl with InputSandboxBaseURI - CREAM 

Jdl with InputSandboxBaseURI                                          | PASS |
------------------------------------------------------------------------------
Jdl with OutputSandboxBaseDestURI                                     ...     
 Jdl with OutputSandboxBaseDestURI - CREAM 

Jdl with OutputSandboxBaseDestURI                                     | FAIL |
[u"Jdl with OutputSandboxBaseDestURI - CREAM : TimeOutError: 'Timeout reached while waiting the job https://emitestbed44.cnaf.infn.it:9000/Jf2vfvz8zrGVb6Wp8FPn6g to finish'"]
------------------------------------------------------------------------------
Jdl with OutputSandboxDestURI                                         ...     
 Jdl with OutputSandboxDestURI - CREAM 

Jdl with OutputSandboxDestURI                                         | FAIL |
[u"Jdl with OutputSandboxDestURI - CREAM : TimeOutError: 'Timeout reached while waiting the job https://emitestbed44.cnaf.infn.it:9000/G2O2BNxwFM_ehos9igNA0g to finish'"]
------------------------------------------------------------------------------
Jdl with FuzzyRank attribute                                          ......
 Jdl with FuzzyRank attribute - CREAM 

Jdl with FuzzyRank attribute                                          | PASS |
------------------------------------------------------------------------------
Jdl with UserTags attribute                                           ......
 Jdl with UserTags attribute - CREAM 

Jdl with UserTags attribute                                           | FAIL |
[u"Jdl with UserTags attribute - CREAM : TimeOutError: 'Timeout reached while waiting the job https://emitestbed44.cnaf.infn.it:9000/bVgbILRXe659f8B1-eaSDw to finish'"]
------------------------------------------------------------------------------
Jdl with LBAddresses attribute                                        .......
 Jdl with LBAddresses attribute - CREAM 

Jdl with LBAddresses attribute                                        | FAIL |
[u"Jdl with LBAddresses attribute - CREAM : TimeOutError: 'Timeout reached while waiting the job https://emitestbed44.cnaf.infn.it:9000/8DBjKBJRVYkeXc0RaE6FWw to finish'"]
------------------------------------------------------------------------------
Jdl with Environment attribute                                        ......
 Jdl with Environment attribute - CREAM 

Jdl with Environment attribute                                        | FAIL |
[u"Jdl with Environment attribute - CREAM : TimeOutError: 'Timeout reached while waiting the job https://emitestbed44.cnaf.infn.it:9000/id8oPJETJl8_aAJoNL-UzQ to finish'"]
------------------------------------------------------------------------------
Jdl with PerusalFileEnable attribute                                  ......
 Jdl with PerusalFileEnable attribute - CREAM 

Jdl with PerusalFileEnable attribute                                  | PASS |
------------------------------------------------------------------------------
Jdl with PerusalTimeInterval attribute                                ......
 Jdl with PerusalTimeInterval attribute - CREAM 

Jdl with PerusalTimeInterval attribute                                | FAIL |
[u"Jdl with PerusalTimeInterval attribute - CREAM : GeneralError: 'Time difference between chunks is shorter than the PerusalTimeInterval value (1300 secs)'"]
------------------------------------------------------------------------------
WMS-jdl-attributes-job-cycle :: WMS Job Cycle Test Suite              | FAIL |
13 critical tests, 4 passed, 9 failed
13 tests total, 4 passed, 9 failed
==============================================================================
Output:  /home/capannini/certificazione/WMSTaskIGIRTC189/output.xml
Log:     /home/capannini/certificazione/WMSTaskIGIRTC189/log.html
Report:  /home/capannini/certificazione/WMSTaskIGIRTC189/report.html

Jdl compound job - SOME FAILURES

[capannini@emitestbed54 WMSTaskIGIRTC189]$ pybot ~/git/WMS-Test-Suite/robot_testsuites/wms_tests/testsuites/WMS-service/WMS-jdl-attributes-coumpound-jobs-cycle.html
==============================================================================
WMS-jdl-attributes-coumpound-jobs-cycle :: WMS Jdl Attributes Coumpound Job...
==============================================================================
Check job cycle using DAG job with jdl that contains other DAG        ....
 Check job cycle using DAG job with jdl that contains other DAG - CREAM 

Check job cycle using DAG job with jdl that contains other DAG        | FAIL |
[u"Check job cycle using DAG job with jdl that contains other DAG - CREAM : GeneralError: 'This test is not yet implemented'"]
------------------------------------------------------------------------------
Check job cycle using DAG job and jdl with DefaultNodeRetryCount a... ....
 Check job cycle using DAG job and jdl with DefaultNodeRetryCount attribute - CREAM 

Check job cycle using DAG job and jdl with DefaultNodeRetryCount a... | FAIL |
[u"Check job cycle using DAG job and jdl with DefaultNodeRetryCount attribute - CREAM : TimeOutError: 'Timeout reached while waiting the job https://emitestbed44.cnaf.infn.it:9000/72PYLYhblQRPr24io1tbKA to finish'"]
------------------------------------------------------------------------------
Check job cycle using jobs collection and jdl with DefaultNodeRetr... ....
 Check job cycle using jobs collection and jdl with DefaultNodeRetryCount attribute - CREAM 

Check job cycle using jobs collection and jdl with DefaultNodeRetr... | FAIL |
[u"Check job cycle using jobs collection and jdl with DefaultNodeRetryCount attribute - CREAM : TimeOutError: 'Timeout reached while waiting the job https://emitestbed44.cnaf.infn.it:9000/ijtm7zpTJkAgiPAe6UWsnQ to finish'"]
------------------------------------------------------------------------------
Check job cycle using DAG job and jdl with DefaultNodeShallowRetry... ....
 Check job cycle using DAG job and jdl with DefaultNodeShallowRetryCount attribute - CREAM 

Check job cycle using DAG job and jdl with DefaultNodeShallowRetry... | FAIL |
[u"Check job cycle using DAG job and jdl with DefaultNodeShallowRetryCount attribute - CREAM : TimeOutError: 'Timeout reached while waiting the job https://emitestbed44.cnaf.infn.it:9000/cm2rzN_U-pZSCAhjpk7TZA to finish'"]
------------------------------------------------------------------------------
Check job cycle using jobs collection and jdl with DefaultNodeShal... ....
 Check job cycle using jobs collection and jdl with DefaultNodeShallowRetryCount attribute - CREAM 

Check job cycle using jobs collection and jdl with DefaultNodeShal... | FAIL |
[u"Check job cycle using jobs collection and jdl with DefaultNodeShallowRetryCount attribute - CREAM : TimeOutError: 'Timeout reached while waiting the job https://emitestbed44.cnaf.infn.it:9000/hB3oyCsxf8_71EnSWZOm2w to finish'"]
------------------------------------------------------------------------------
Check job cycle using DAG job and jdl with AllowZippedISB attribute   ....
 Check job cycle using DAG job and jdl with AllowZippedISB attribute - CREAM 

Check job cycle using DAG job and jdl with AllowZippedISB attribute   | FAIL |
[u"Check job cycle using DAG job and jdl with AllowZippedISB attribute - CREAM : GeneralError: 'Message Archiving the ISB files not found'"]
------------------------------------------------------------------------------
Check job cycle using jobs collection and jdl with AllowZippedISB ... ....
 Check job cycle using jobs collection and jdl with AllowZippedISB attribute - CREAM 

Check job cycle using jobs collection and jdl with AllowZippedISB ... | FAIL |
[u"Check job cycle using jobs collection and jdl with AllowZippedISB attribute - CREAM : GeneralError: 'Message Archiving the ISB files not found'"]
------------------------------------------------------------------------------
Check job cycle using DAG job and jdl with UserTags attribute         ....
 Check job cycle using DAG job and jdl with UserTags attribute - CREAM 

Check job cycle using DAG job and jdl with UserTags attribute         | FAIL |
[u"Check job cycle using DAG job and jdl with UserTags attribute - CREAM : TimeOutError: 'Timeout reached while waiting the job https://emitestbed44.cnaf.infn.it:9000/jXhi2U_1dbelPdaezPK95A to finish'"]
------------------------------------------------------------------------------
Check job cycle using jobs collection and jdl with UserTags attribute ....
 Check job cycle using jobs collection and jdl with UserTags attribute - CREAM 

Check job cycle using jobs collection and jdl with UserTags attribute | FAIL |
[u"Check job cycle using jobs collection and jdl with UserTags attribute - CREAM : RunCommandError: 'Command glite-wms-job-status --verbosity 0 https://emitestbed44.cnaf.infn.it:9000/EIbJUl14EOkZTGW7mfiuuQ failed. Failure message: **** Error: UI_PROXY_EXPIRED ****  \\nProxy certificate validity expired.\\n\\n'"]
------------------------------------------------------------------------------
Check job cycle using DAG job and jdl with ExpiryTime attribute       ....
 Check job cycle using DAG job and jdl with ExpiryTime attribute - CREAM 

Check job cycle using DAG job and jdl with ExpiryTime attribute       | FAIL |
[u"Check job cycle using DAG job and jdl with ExpiryTime attribute - CREAM : RunCommandError: u'Command glite-wms-job-submit -a -c /home/capannini/certificazione/WMSTaskIGIRTC189/WMSService-WMS-jdl-attributes-coumpound-jobs-cycle_20140828155636/wms.conf --nomsg /home/capannini/certificazione/WMSTaskIGIRTC189/WMSService-WMS-jdl-attributes-coumpound-jobs-cycle_20140828155636/example.jdl failed. Failure message: \\nError - Proxy validity Error\\nYour proxy credential has expired\\n'"]
------------------------------------------------------------------------------
Check job cycle using jobs collection and jdl with ExpiryTime attr... ....
 Check job cycle using jobs collection and jdl with ExpiryTime attribute - CREAM 

Check job cycle using jobs collection and jdl with ExpiryTime attr... | FAIL |
[u"Check job cycle using jobs collection and jdl with ExpiryTime attribute - CREAM : RunCommandError: u'Command glite-wms-job-submit -a -c /home/capannini/certificazione/WMSTaskIGIRTC189/WMSService-WMS-jdl-attributes-coumpound-jobs-cycle_20140828155636/wms.conf --nomsg /home/capannini/certificazione/WMSTaskIGIRTC189/WMSService-WMS-jdl-attributes-coumpound-jobs-cycle_20140828155636/example.jdl failed. Failure message: \\nError - Proxy validity Error\\nYour proxy credential has expired\\n'"]
------------------------------------------------------------------------------
WMS-jdl-attributes-coumpound-jobs-cycle :: WMS Jdl Attributes Coum... | FAIL |
11 critical tests, 0 passed, 11 failed
11 tests total, 0 passed, 11 failed
==============================================================================
Output:  /home/capannini/certificazione/WMSTaskIGIRTC189/output.xml
Log:     /home/capannini/certificazione/WMSTaskIGIRTC189/log.html
Report:  /home/capannini/certificazione/WMSTaskIGIRTC189/report.html

[capannini@emitestbed54 WMSTaskIGIRTC189]$ pybot -i case9 -i case10 -i case11 ~/git/WMS-Test-Suite/robot_testsuites/wms_tests/testsuites/WMS-service/WMS-jdl-attributes-coumpound-jobs-cycle.html
==============================================================================
WMS-jdl-attributes-coumpound-jobs-cycle :: WMS Jdl Attributes Coumpound Job...
==============================================================================
Check job cycle using jobs collection and jdl with UserTags attribute ....
 Check job cycle using jobs collection and jdl with UserTags attribute - CREAM 

Check job cycle using jobs collection and jdl with UserTags attribute | PASS |
------------------------------------------------------------------------------
Check job cycle using DAG job and jdl with ExpiryTime attribute       ....
 Check job cycle using DAG job and jdl with ExpiryTime attribute - CREAM 

Check job cycle using DAG job and jdl with ExpiryTime attribute       | FAIL |
[u"Check job cycle using DAG job and jdl with ExpiryTime attribute - CREAM : TimeOutError: 'Timeout reached while waiting the job https://emitestbed44.cnaf.infn.it:9000/ePHAvY9oFiplnh1xy7mJWA to finish'"]
------------------------------------------------------------------------------
Check job cycle using jobs collection and jdl with ExpiryTime attr... ....
 Check job cycle using jobs collection and jdl with ExpiryTime attribute - CREAM 

Check job cycle using jobs collection and jdl with ExpiryTime attr... | FAIL |
[u"Check job cycle using jobs collection and jdl with ExpiryTime attribute - CREAM : TimeOutError: 'Timeout reached while waiting the job https://emitestbed44.cnaf.infn.it:9000/jpHzhz9pa1VF29btM6hb2Q to finish'"]
------------------------------------------------------------------------------
WMS-jdl-attributes-coumpound-jobs-cycle :: WMS Jdl Attributes Coum... | FAIL |
3 critical tests, 1 passed, 2 failed
3 tests total, 1 passed, 2 failed
==============================================================================
Output:  /home/capannini/certificazione/WMSTaskIGIRTC189/output.xml
Log:     /home/capannini/certificazione/WMSTaskIGIRTC189/log.html
Report:  /home/capannini/certificazione/WMSTaskIGIRTC189/report.html

Job resubmission - PASSED

[capannini@emitestbed54 WMSTaskIGIRTC189]$ pybot ~/git/WMS-Test-Suite/robot_testsuites/wms_tests/testsuites/WMS-service/WMS-job-resubmit.html
==============================================================================
WMS-job-resubmit :: WMS Job Resubmit Test Suite                               
==============================================================================
Shallow Resubmission                                                  ....
 Shallow Resubmission - CREAM 

Shallow Resubmission                                                  | PASS |
------------------------------------------------------------------------------
Deep Resubmission                                                     ....
 Deep Resubmission - CREAM 

Deep Resubmission                                                     | PASS |
------------------------------------------------------------------------------
WMS-job-resubmit :: WMS Job Resubmit Test Suite                       | PASS |
2 critical tests, 2 passed, 0 failed
2 tests total, 2 passed, 0 failed
==============================================================================
Output:  /home/capannini/certificazione/WMSTaskIGIRTC189/output.xml
Log:     /home/capannini/certificazione/WMSTaskIGIRTC189/log.html
Report:  /home/capannini/certificazione/WMSTaskIGIRTC189/report.html

Limiter mechanism - FAILED

[capannini@emitestbed54 WMSTaskIGIRTC189]$ pybot ~/git/WMS-Test-Suite/robot_testsuites/wms_tests/testsuites/WMS-service/WMS-limiter-mechanism.html
==============================================================================
WMS-limiter-mechanism :: Test the WMS limiter mechanism operation             
==============================================================================
Test Option load1                                                     | FAIL |
Failure reason is not 'System load is too high' as expected: '
Connecting to the service https://emitestbed44.cnaf.infn.it:7443/glite_wms_wmproxy_server


Connection failed: CA certificate verification failed



Error - Operation failed
Unable to find any endpoint where to perform service request
' does not contain 'System load is too high'
------------------------------------------------------------------------------
Test Option load5                                                     | FAIL |
Failure reason is not 'System load is too high' as expected: '
Connecting to the service https://emitestbed44.cnaf.infn.it:7443/glite_wms_wmproxy_server


Connection failed: CA certificate verification failed



Error - Operation failed
Unable to find any endpoint where to perform service request
' does not contain 'System load is too high'
------------------------------------------------------------------------------
Test Option load15                                                    | FAIL |
Failure reason is not 'System load is too high' as expected: '
Connecting to the service https://emitestbed44.cnaf.infn.it:7443/glite_wms_wmproxy_server


Connection failed: CA certificate verification failed



Error - Operation failed
Unable to find any endpoint where to perform service request
' does not contain 'System load is too high'
------------------------------------------------------------------------------
Test Option memusage                                                  | FAIL |
Failure reason is not 'System load is too high' as expected: '
Connecting to the service https://emitestbed44.cnaf.infn.it:7443/glite_wms_wmproxy_server


Connection failed: CA certificate verification failed



Error - Operation failed
Unable to find any endpoint where to perform service request
' does not contain 'System load is too high'
------------------------------------------------------------------------------
Test Option swapusage                                                 | FAIL |
Failure reason is not 'System load is too high' as expected: '
Connecting to the service https://emitestbed44.cnaf.infn.it:7443/glite_wms_wmproxy_server


Connection failed: CA certificate verification failed



Error - Operation failed
Unable to find any endpoint where to perform service request
' does not contain 'System load is too high'
------------------------------------------------------------------------------
Test Option ftpconn                                                   | FAIL |
Failure reason is not 'System load is too high' as expected: '
Connecting to the service https://emitestbed44.cnaf.infn.it:7443/glite_wms_wmproxy_server


Connection failed: CA certificate verification failed



Error - Operation failed
Unable to find any endpoint where to perform service request
' does not contain 'System load is too high'
------------------------------------------------------------------------------
Test Option diskusage                                                 | FAIL |
Failure reason is not 'System load is too high' as expected: '
Connecting to the service https://emitestbed44.cnaf.infn.it:7443/glite_wms_wmproxy_server


Connection failed: CA certificate verification failed



Error - Operation failed
Unable to find any endpoint where to perform service request
' does not contain 'System load is too high'
------------------------------------------------------------------------------
Test Option fdnum                                                     | FAIL |
Failure reason is not 'System load is too high' as expected: '
Connecting to the service https://emitestbed44.cnaf.infn.it:7443/glite_wms_wmproxy_server


Connection failed: CA certificate verification failed



Error - Operation failed
Unable to find any endpoint where to perform service request
' does not contain 'System load is too high'
------------------------------------------------------------------------------
Test Option jdnum                                                     | FAIL |
Failure reason is not 'System load is too high' as expected: '
Connecting to the service https://emitestbed44.cnaf.infn.it:7443/glite_wms_wmproxy_server


Connection failed: CA certificate verification failed



Error - Operation failed
Unable to find any endpoint where to perform service request
' does not contain 'System load is too high'
------------------------------------------------------------------------------
Test Option jdsize                                                    | FAIL |
Failure reason is not 'System load is too high' as expected: '
Connecting to the service https://emitestbed44.cnaf.infn.it:7443/glite_wms_wmproxy_server


Connection failed: CA certificate verification failed



Error - Operation failed
Unable to find any endpoint where to perform service request
' does not contain 'System load is too high'
------------------------------------------------------------------------------
WMS-limiter-mechanism :: Test the WMS limiter mechanism operation     | FAIL |
10 critical tests, 0 passed, 10 failed
10 tests total, 0 passed, 10 failed
==============================================================================
Output:  /home/capannini/certificazione/WMSTaskIGIRTC189/output.xml
Log:     /home/capannini/certificazione/WMSTaskIGIRTC189/log.html
Report:  /home/capannini/certificazione/WMSTaskIGIRTC189/report.html

List-match - PASSED

[capannini@emitestbed54 WMSTaskIGIRTC189]$ pybot ~/git/WMS-Test-Suite/robot_testsuites/wms_tests/testsuites/WMS-service/WMS-list-match.html
==============================================================================
WMS-list-match :: WMS list match testing suite.                               
==============================================================================
Check Executables                                                     | PASS |
------------------------------------------------------------------------------
Simple Matching                                                       | PASS |
------------------------------------------------------------------------------
Delegation Matching                                                   | PASS |
------------------------------------------------------------------------------
Exclude CE from Match                                                 | PASS |
------------------------------------------------------------------------------
Failure Matching                                                      | PASS |
------------------------------------------------------------------------------
Matching (EnableWMSFeedback True)                                     | PASS |
------------------------------------------------------------------------------
WMS-list-match :: WMS list match testing suite.                       | PASS |
6 critical tests, 6 passed, 0 failed
6 tests total, 6 passed, 0 failed
==============================================================================
Output:  /home/capannini/certificazione/WMSTaskIGIRTC189/output.xml
Log:     /home/capannini/certificazione/WMSTaskIGIRTC189/log.html
Report:  /home/capannini/certificazione/WMSTaskIGIRTC189/report.html

Prologue/Epilogue - PASSED

[capannini@emitestbed54 WMSTaskIGIRTC189]$ pybot ~/git/WMS-Test-Suite/robot_testsuites/wms_tests/testsuites/WMS-service/WMS-prologue-epilogue.html
==============================================================================
WMS-prologue-epilogue :: WMS Prologue Epilogue Test Suite                     
==============================================================================
Prologue                                                              ....
 Prologue - CREAM 

Prologue                                                              | PASS |
------------------------------------------------------------------------------
Epilogue                                                              ....
 Epilogue - CREAM 

Epilogue                                                              | PASS |
------------------------------------------------------------------------------
Prologue and Epilogue                                                 ....
 Prologue and Epilogue - CREAM 

Prologue and Epilogue                                                 | PASS |
------------------------------------------------------------------------------
WMS-prologue-epilogue :: WMS Prologue Epilogue Test Suite             | PASS |
3 critical tests, 3 passed, 0 failed
3 tests total, 3 passed, 0 failed
==============================================================================
Output:  /home/capannini/certificazione/WMSTaskIGIRTC189/output.xml
Log:     /home/capannini/certificazione/WMSTaskIGIRTC189/log.html
Report:  /home/capannini/certificazione/WMSTaskIGIRTC189/report.html

Proxy renewal - SOME FAILURES

[capannini@emitestbed54 WMSTaskIGIRTC189]$ myproxy-init -s myproxy.cnaf.infn.it -d -n --verbose
MyProxy v5.9 Jul 2012 PAM SASL KRB5 LDAP VOMS OCSP
Socket bound to port 20000. 
Attempting to connect to 131.154.101.138:7512 
Successfully connected to myproxy.cnaf.infn.it:7512 
Error: Couldn't find valid credentials to generate a proxy.
       grid_proxy_init.c:549: globus_sysconfig: Error with certificate filename
globus_sysconfig: Error with certificate filename
globus_sysconfig: File has bad permissions: Permissions on /home/capannini/.globus/usercert.pem are too permissive. Maximum allowable permissions are 644
grid-proxy-init failed
[capannini@emitestbed54 WMSTaskIGIRTC189]$ chmod 644 /home/capannini/.globus/usercert.pem
[capannini@emitestbed54 WMSTaskIGIRTC189]$ myproxy-init -s myproxy.cnaf.infn.it -d -n --verbose
MyProxy v5.9 Jul 2012 PAM SASL KRB5 LDAP VOMS OCSP
Socket bound to port 20000. 
Attempting to connect to 131.154.101.137:7512 
Successfully connected to myproxy.cnaf.infn.it:7512 

User Cert File: /home/capannini/.globus/usercert.pem
User Key File: /home/capannini/.globus/userkey.pem

Trusted CA Cert Dir: /etc/grid-security/certificates

Output File: /tmp/myproxy-proxy.501.19585
Your identity: /C=IT/O=INFN/OU=Personal Certificate/L=CNAF/CN=Fabio Capannini
Enter GRID pass phrase for this identity:
Creating proxy .......................+++
.........................................+++
 Done
Proxy Verify OK
Your proxy is valid until: Mon Sep  8 10:49:40 2014
using trusted certificates directory /etc/grid-security/certificates
Using Proxy file (/tmp/myproxy-proxy.501.19585)
server name: /C=IT/O=INFN/OU=Host/L=CNAF/CN=myproxy01.cnaf.infn.it
checking that server name is acceptable...
server name matches "myproxy@myproxy01.cnaf.infn.it"
authenticated server name is acceptable
A proxy valid for 168 hours (7.0 days) for user /C=IT/O=INFN/OU=Personal Certificate/L=CNAF/CN=Fabio Capannini now exists on myproxy.cnaf.infn.it.

[root@emitestbed44 ~]# rm -rf /var/ice/persist_dir/*
[root@emitestbed44 ~]# rm -f /var/glite/spool/glite-renewd/*
[root@emitestbed44 ~]# /etc/init.d/glite-wms-ice restart
stopping ICE... ok
starting ICE... ok

[capannini@emitestbed54 WMSTaskIGIRTC189]$ pybot ~/git/WMS-Test-Suite/robot_testsuites/wms_tests/testsuites/WMS-service/WMS-proxy-renewal.html
==============================================================================
WMS-proxy-renewal :: WMS Proxy Renewal Test Suite                             
==============================================================================
Proxy renewal                                                         ....
 Proxy renewal - CREAM 

Proxy renewal                                                         | PASS |
------------------------------------------------------------------------------
Proxy renewal without setting MYPROXYSERVER                           ....
 Proxy renewal without setting MYPROXYSERVER - CREAM 

[ WARN ] Unexpected failed reason                                             
Proxy renewal without setting MYPROXYSERVER                           | FAIL |
[u"Proxy renewal without setting MYPROXYSERVER - CREAM : GeneralError: 'Unexpected failed reason'"]
------------------------------------------------------------------------------
WMS-proxy-renewal :: WMS Proxy Renewal Test Suite                     | FAIL |
2 critical tests, 1 passed, 1 failed
2 tests total, 1 passed, 1 failed
==============================================================================
Output:  /home/capannini/certificazione/WMSTaskIGIRTC189/output.xml
Log:     /home/capannini/certificazione/WMSTaskIGIRTC189/log.html
Report:  /home/capannini/certificazione/WMSTaskIGIRTC189/report.html

Purger - PASSED

[capannini@emitestbed54 WMSTaskIGIRTC189]$ pybot -e case1 -e case6 -e case7 ~/git/WMS-Test-Suite/robot_testsuites/wms_tests/testsuites/WMS-service/WMS-check-purger.html
==============================================================================
WMS-check-purger :: WMS Check Purger Test Suite                               
==============================================================================
Test purge , normal job cycle ( Submit to CREAM CE )                  | PASS |
------------------------------------------------------------------------------
Test proxy cache purging                                              | PASS |
------------------------------------------------------------------------------
SandBoxDir cron purger ( Submit a job and force its purge before i... | PASS |
------------------------------------------------------------------------------
SandBoxDir cron purger ( Purge a DONE job )                           | PASS |
------------------------------------------------------------------------------
SandBoxDir cron purger ( Purge a DAG job )                            | PASS |
------------------------------------------------------------------------------
WMS-check-purger :: WMS Check Purger Test Suite                       | PASS |
5 critical tests, 5 passed, 0 failed
5 tests total, 5 passed, 0 failed
==============================================================================
Output:  /home/capannini/certificazione/WMSTaskIGIRTC189/output.xml
Log:     /home/capannini/certificazione/WMSTaskIGIRTC189/log.html
Report:  /home/capannini/certificazione/WMSTaskIGIRTC189/report.html

Configuration SOME FAILURES

[capannini@emitestbed54 WMSTaskIGIRTC189]$ pybot ~/git/WMS-Test-Suite/robot_testsuites/wms_tests/testsuites/WMS-service/WMS-check-configuration-3.4.html
==============================================================================
WMS-check-configuration-3.4 :: Check the syntax of the WMS configuration fi...
==============================================================================
Check Common Section                                                  | PASS |
------------------------------------------------------------------------------
Check JobController Section                                           | PASS |
------------------------------------------------------------------------------
Check NetworkServer Section                                           | PASS |
------------------------------------------------------------------------------
Check LogMonitor Section                                              | PASS |
------------------------------------------------------------------------------
Check WorkloadManager Section                                         | FAIL |
GeneralError: u'Section: WorkloadManager , problem with following attributes: set([\'IsmThreads  =  true;\', \'IsmIiLDAPCEFilterExt  =  "(|(GlueCEAccessControlBaseRule=VO:testers.eu-emi.eu)(GlueCEAccessControlBaseRule=VOMS:/testers.eu-emi.eu/*)(GlueCEAccessControlBaseRule=VO:testers2.eu-emi.eu)(GlueCEAccessControlBaseRule=VOMS:/testers2.eu-emi.eu/*)(GlueCEAccessControlBaseRule=VO:testers3.eu-emi.eu)(GlueCEAccessControlBaseRule=VOMS:/testers3.eu-emi.eu/*)(GlueCEAccessControlBaseRule=VO:dteam)(GlueCEAccessControlBaseRule=VOMS:/dteam/*)(GlueCEAccessControlBaseRule=VO:infngrid)(GlueCEAccessControlBaseRule=VOMS:/infngrid/*))";\', \'IsmThreads  =  false;\', \'IsmIiLDAPCEFilterExt  =  "(|(GlueCEAccessControlBaseRule=VO:testers.eu-emi.eu)(GlueCEAccessControlBaseRule=VOMS:/testers.eu-emi.eu/*)(GlueCEAccessControlBaseRule=VO:testers2.eu-emi.eu)(GlueCEAccessControlBaseRule=VOMS:/testers2.eu-emi.eu/*)(GlueCEAccessControlBaseRule=VO:cms)(GlueCEAccessControlBaseRule=VOMS:/cms/*)(GlueCEAccessControlBaseRule=VO:dteam)(GlueCEAccessControlBaseRule=VOMS:/dteam/*)(GlueCEAccessControlBaseRule=VO:infngrid)(GlueCEAccessControlBaseRule=VOMS:/infngrid/*))";\'])'
------------------------------------------------------------------------------
Check WorkloadManagerProxy Section                                    | FAIL |
GeneralError: u'Section: WorkloadManagerProxy , problem with following attributes: set([\'AsyncJobStart  =  true;\', \'AsyncJobStart  =  false;\', \'Wms_Pepc_ResourceId  =  "https://emitestbed44.cnaf.infn.it:7443/glite_wms_wmproxy_server";\'])'
------------------------------------------------------------------------------
Check ICE Section                                                     | FAIL |
GeneralError: u"Section: ICE , problem with following attributes: set(['proxy_renewal_timeout  =  120;', 'ice_log_level   =   500;', 'ice_log_level   =   300;'])"
------------------------------------------------------------------------------
Check Variables                                                       | FAIL |
This test requires the YAIM_FILE configuration file. Please set the YAIM_FILE variable in the test's configuration file.
------------------------------------------------------------------------------
WMS-check-configuration-3.4 :: Check the syntax of the WMS configu... | FAIL |
8 critical tests, 4 passed, 4 failed
8 tests total, 4 passed, 4 failed
==============================================================================
Output:  /home/capannini/certificazione/WMSTaskIGIRTC189/output.xml
Log:     /home/capannini/certificazione/WMSTaskIGIRTC189/log.html
Report:  /home/capannini/certificazione/WMSTaskIGIRTC189/report.html

Delegation - SOME FAILURES

[capannini@emitestbed54 WMSTaskIGIRTC189]$ pybot ~/git/WMS-Test-Suite/robot_testsuites/wms_tests/testsuites/WMS-service/WMS-delegation.html
==============================================================================
WMS-delegation :: WMS Delegation Test Suite                                   
==============================================================================
Check --autm-delegation option                                        | PASS |
------------------------------------------------------------------------------
Check --delegationid option                                           | PASS |
------------------------------------------------------------------------------
Try to delegate with a short proxy                                    | PASS |
------------------------------------------------------------------------------
Works with expired proxy                                              | FAIL |
RunCommandError: u'Command glite-wms-job-info --config /home/capannini/certificazione/WMSTaskIGIRTC189/WMSService-WMS-delegation_20140901150839/wms.conf -d deleg-1409576934 failed. Failure message: \nConnecting to the service https://emitestbed44.cnaf.infn.it:7443/glite_wms_wmproxy_server\n\n\nError - WMProxy Server Error\nProxy exception: the proxy has expired\nError code: SOAP-ENV:Server\n\n'
------------------------------------------------------------------------------
Works with long chain proxies (ggus ticket 79096)                     | FAIL |
GeneralError: 'Failed to create a valid user proxy'
------------------------------------------------------------------------------
WMS-delegation :: WMS Delegation Test Suite                           | FAIL |
5 critical tests, 3 passed, 2 failed
5 tests total, 3 passed, 2 failed
==============================================================================
Output:  /home/capannini/certificazione/WMSTaskIGIRTC189/output.xml
Log:     /home/capannini/certificazione/WMSTaskIGIRTC189/log.html
Report:  /home/capannini/certificazione/WMSTaskIGIRTC189/report.html

Feedback - PASSED

[capannini@emitestbed54 WMSTaskIGIRTC189]$ pybot ~/git/WMS-Test-Suite/robot_testsuites/wms_tests/testsuites/WMS-service/WMS-feedback-test.html
==============================================================================
WMS-feedback-test :: Test the WMS limiter mechanism operation                 
==============================================================================
Test WMS feedback feature                                             | PASS |
------------------------------------------------------------------------------
WMS-feedback-test :: Test the WMS limiter mechanism operation         | PASS |
1 critical test, 1 passed, 0 failed
1 test total, 1 passed, 0 failed
==============================================================================
Output:  /home/capannini/certificazione/WMSTaskIGIRTC189/output.xml
Log:     /home/capannini/certificazione/WMSTaskIGIRTC189/log.html
Report:  /home/capannini/certificazione/WMSTaskIGIRTC189/report.html
</feedback>
   * [[%ATTACHURL%/feedback.tgz][feedback.tgz]]: feedback.tgz


-- Main.FabioCapannini - 2014-08-27

























Topic attachments
I AttachmentSorted descending Action Size Date Who Comment
Unknown file formatlog update_emitestbed44.log manage 72.6 K 2014-08-27 - 13:51 FabioCapannini  
Compressed Zip archivetgz submit.tgz manage 210.7 K 2014-08-28 - 07:41 FabioCapannini  
Compressed Zip archivetgz resubmit.tgz manage 125.7 K 2014-08-29 - 14:38 FabioCapannini  
Compressed Zip archivetgz purger.tgz manage 133.0 K 2014-09-01 - 13:04 FabioCapannini  
Compressed Zip archivetgz proxy.tgz manage 134.1 K 2014-09-01 - 12:29 FabioCapannini  
Compressed Zip archivetgz prologue-epilogue.tgz manage 127.7 K 2014-08-29 - 15:08 FabioCapannini  
Compressed Zip archivetgz listmatch.tgz manage 118.2 K 2014-08-29 - 14:46 FabioCapannini  
Compressed Zip archivetgz limiter.tgz manage 134.1 K 2014-08-29 - 14:42 FabioCapannini  
Compressed Zip archivetgz jdl.tgz manage 225.1 K 2014-08-28 - 13:55 FabioCapannini  
Compressed Zip archivetgz jdl-compound.tgz manage 235.7 K 2014-08-29 - 08:01 FabioCapannini  
Compressed Zip archivetgz jdl-compound.1.tgz manage 156.9 K 2014-08-29 - 14:11 FabioCapannini  
Compressed Zip archivetgz feedback.tgz manage 128.8 K 2014-09-01 - 14:00 FabioCapannini  
Compressed Zip archivetgz deleg.tgz manage 124.9 K 2014-09-01 - 13:32 FabioCapannini  
Compressed Zip archivetgz config.tgz manage 116.5 K 2014-09-01 - 13:07 FabioCapannini  
Edit | Attach | PDF | History: r9 < r8 < r7 < r6 < r5 | Backlinks | Raw View | More topic actions...
Topic revision: r7 - 2014-09-01 - FabioCapannini
 
  • Edit
  • Attach
This site is powered by the TWiki collaboration platformCopyright © 2008-2019 by the contributing authors. All material on this collaboration platform is the property of the contributing authors.
Ideas, requests, problems regarding TWiki? Send feedback