Tags:
, view all tags

WMS 3.6.1 test report - IGIRTC-166

Testing SL5

Testing SL6

Job submission - SOME FAILURES

[capannini@emitestbed54 WMSTaskIGIRTC166]$ pybot ~/git/WMS-Test-Suite/robot_testsuites/wms_tests/testsuites/WMS-service/WMS-job-cycle.html 
==============================================================================
WMS-job-cycle :: WMS Job Cycle Test Suite                                     
==============================================================================
Submit Normal Job                                                     ......
 Submit Normal Job - CREAM 

Submit Normal Job                                                     | PASS |
------------------------------------------------------------------------------
Submit Bulk of Jobs                                                   ......
 Submit Bulk of Jobs - CREAM 

Submit Bulk of Jobs                                                   | PASS |
------------------------------------------------------------------------------
Submit Parametric Job                                                 ......
 Submit Parametric Job - CREAM 

Submit Parametric Job                                                 | PASS |
------------------------------------------------------------------------------
Submit DAG Job                                                        | PASS |
------------------------------------------------------------------------------
Submit MPI Job                                                        ......
 Submit MPI Job - CREAM 

Submit MPI Job                                                        | PASS |
------------------------------------------------------------------------------
Submit Perusal Job                                                    ....
 Submit Perusal Job - CREAM 

Submit Perusal Job                                                    | FAIL |
[u"Submit Perusal Job - CREAM : GeneralError: 'No chunks have been retrieved.'"]
------------------------------------------------------------------------------
Submit Bulk of Jobs , using a single jdl with all jdls of nodes       ......
 Submit Bulk of Jobs , using a single jdl with all jdls of nodes - CREAM 

Submit Bulk of Jobs , using a single jdl with all jdls of nodes       | PASS |
------------------------------------------------------------------------------
Testing forwarding parameters for parallel jobs                       ....
 Case1 


 Case 2 


 Case 3 


 Case 4 


 Case 5 

Testing forwarding parameters for parallel jobs                       | PASS |
------------------------------------------------------------------------------
WMS-job-cycle :: WMS Job Cycle Test Suite                             | FAIL |
8 critical tests, 7 passed, 1 failed
8 tests total, 7 passed, 1 failed
==============================================================================
Output:  /home/capannini/certificazione/WMSTaskIGIRTC166/output.xml
Log:     /home/capannini/certificazione/WMSTaskIGIRTC166/log.html
Report:  /home/capannini/certificazione/WMSTaskIGIRTC166/report.html

Jdl attributes - SOME FAILURES

[capannini@emitestbed54 WMSTaskIGIRTC166]$ pybot ~/git/WMS-Test-Suite/robot_testsuites/wms_tests/testsuites/WMS-service/WMS-jdl-attributes-job-cycle.html
==============================================================================
WMS-jdl-attributes-job-cycle :: WMS Job Cycle Test Suite                      
==============================================================================
Jdl with AllowZippedISB                                               ....
 Jdl with AllowZippedISB - CREAM 

Jdl with AllowZippedISB                                               | FAIL |
Message 'Archiving the ISB files' not found: '-----------------------------------------
05 Nov 2013, 10:43:34 -I- PID: 29884 (Debug) - Vo read from proxy certificate extension
-----------------------------------------
-----------------------------------------
05 Nov 2013, 10:43:34 -I- PID: 29884 (Debug) - VirtualOrganisation value : testers.eu-emi.eu
-----------------------------------------
-----------------------------------------
05 Nov 2013, 10:43:34 -I- PID: 29884 (Debug) - Loaded user configuration file:
 /home/capannini/certificazione/WMSTaskIGIRTC166/WMSService-WMS-jdl-attributes-job-cycle_20131105104334/wms.conf
-----------------------------------------
-----------------------------------------
05 Nov 2013, 10:43:34 -I- PID: 29884 (Debug) - Configuration file: //etc/glite-wms/testers.eu-emi.eu/glite_wmsui.conf - VirtualOrganisation, MyProxyServer attribute(s) no more supported outside JDL Default Attributes section "JdlDefaultAttributes"
-----------------------------------------
    [ Message content over the limit has been removed. ]
...013, 10:43:37 -I- PID: 29884 (Debug) - Calling the WMProxy jobStart service
-----------------------------------------
-----------------------------------------
05 Nov 2013, 10:43:37 -I- PID: 29884 (Debug) - jobStart -  The job has been successfully started
-----------------------------------------

====================== glite-wms-job-submit Success ======================

The job has been successfully submitted to the WMProxy
Your job identifier is:

https://emitestbed44.cnaf.infn.it:9000/pPV9W3FPAX1LDa9GnObEew

==========================================================================

      *** Log file created ***
Possible Errors and Debug messages have been printed in the following file:
/tmp/glite-wms-job-submit_501_29884_20131105_10-43-34.log
' does not contain 'Archiving the ISB files'
------------------------------------------------------------------------------
Jdl with ExpiryTime                                                   | PASS |
------------------------------------------------------------------------------
Jdl with ShortDeadlineJob                                             ......
 Jdl with ShortDeadlineJob - CREAM 

Jdl with ShortDeadlineJob                                             | FAIL |
[u'CREAM : No Computing Element matching your job requirements has been found']
------------------------------------------------------------------------------
Jdl with DataRequirements                                             | FAIL |
RunCommandError: u'Command lfc-mkdir /grid/testers.eu-emi.eu/20131105104334 failed. Failure message: send2nsd: NS009 - fatal configuration error: Host unknown: emi2rc-sl5-lfc.cern.ch\ncannot create /grid/testers.eu-emi.eu/20131105104334: Host not known'
------------------------------------------------------------------------------
Jdl with InputSandboxBaseURI                                          ....    
 Jdl with InputSandboxBaseURI - CREAM 

Jdl with InputSandboxBaseURI                                          | PASS |
------------------------------------------------------------------------------
Jdl with OutputSandboxBaseDestURI                                     ...     
 Jdl with OutputSandboxBaseDestURI - CREAM 

Jdl with OutputSandboxBaseDestURI                                     | PASS |
------------------------------------------------------------------------------
Jdl with OutputSandboxDestURI                                         ...     
 Jdl with OutputSandboxDestURI - CREAM 

Jdl with OutputSandboxDestURI                                         | PASS |
------------------------------------------------------------------------------
Jdl with FuzzyRank attribute                                          ......
 Jdl with FuzzyRank attribute - CREAM 

Jdl with FuzzyRank attribute                                          | PASS |
------------------------------------------------------------------------------
Jdl with UserTags attribute                                           ......
 Jdl with UserTags attribute - CREAM 

Jdl with UserTags attribute                                           | PASS |
------------------------------------------------------------------------------
Jdl with LBAddresses attribute                                        .......
 Jdl with LBAddresses attribute - CREAM 

Jdl with LBAddresses attribute                                        | PASS |
------------------------------------------------------------------------------
Jdl with Environment attribute                                        ......
 Jdl with Environment attribute - CREAM 

Jdl with Environment attribute                                        | PASS |
------------------------------------------------------------------------------
Jdl with PerusalFileEnable attribute                                  ......
 Jdl with PerusalFileEnable attribute - CREAM 

Jdl with PerusalFileEnable attribute                                  | PASS |
------------------------------------------------------------------------------
Jdl with PerusalTimeInterval attribute                                ......
 Jdl with PerusalTimeInterval attribute - CREAM 

Jdl with PerusalTimeInterval attribute                                | FAIL |
[u"Jdl with PerusalTimeInterval attribute - CREAM : GeneralError: 'Time difference between chunks is shorter than the PerusalTimeInterval value (1300 secs)'"]
------------------------------------------------------------------------------
WMS-jdl-attributes-job-cycle :: WMS Job Cycle Test Suite              | FAIL |
13 critical tests, 9 passed, 4 failed
13 tests total, 9 passed, 4 failed
==============================================================================
Output:  /home/capannini/certificazione/WMSTaskIGIRTC166/output.xml
Log:     /home/capannini/certificazione/WMSTaskIGIRTC166/log.html
Report:  /home/capannini/certificazione/WMSTaskIGIRTC166/report.html

Jdl attributes compound job - FAILED

[capannini@emitestbed54 WMSTaskIGIRTC166]$ pybot ~/git/WMS-Test-Suite/robot_testsuites/wms_tests/testsuites/WMS-service/WMS-jdl-attributes-coumpound-jobs-cycle.html 
==============================================================================
WMS-jdl-attributes-coumpound-jobs-cycle :: WMS Jdl Attributes Coumpound Job...
==============================================================================
Check job cycle using DAG job with jdl that contains other DAG        ....
 Check job cycle using DAG job with jdl that contains other DAG - CREAM 

Check job cycle using DAG job with jdl that contains other DAG        | FAIL |
[u"Check job cycle using DAG job with jdl that contains other DAG - CREAM : GeneralError: 'This test is not yet implemented'"]
------------------------------------------------------------------------------
Check job cycle using DAG job and jdl with DefaultNodeRetryCount a... ....
 Check job cycle using DAG job and jdl with DefaultNodeRetryCount attribute - CREAM 

Check job cycle using DAG job and jdl with DefaultNodeRetryCount a... | FAIL |
[u'Check job cycle using DAG job and jdl with DefaultNodeRetryCount attribute - CREAM : GeneralError: "Coumpound job https://emitestbed44.cnaf.infn.it:9000/E_zTWZzN6ZyfMDsutfXpIw hasn\'t be correctly resubmitted"']
------------------------------------------------------------------------------
Check job cycle using jobs collection and jdl with DefaultNodeRetr... ....
 Check job cycle using jobs collection and jdl with DefaultNodeRetryCount attribute - CREAM 

Check job cycle using jobs collection and jdl with DefaultNodeRetr... | FAIL |
[u"Check job cycle using jobs collection and jdl with DefaultNodeRetryCount attribute - CREAM : TimeOutError: 'Timeout reached while waiting the job https://emitestbed44.cnaf.infn.it:9000/IukSMToC0Z1LlytfXl0-tw to finish'"]
------------------------------------------------------------------------------
Check job cycle using DAG job and jdl with DefaultNodeShallowRetry... ....
 Check job cycle using DAG job and jdl with DefaultNodeShallowRetryCount attribute - CREAM 

Check job cycle using DAG job and jdl with DefaultNodeShallowRetry... | FAIL |
[u'Check job cycle using DAG job and jdl with DefaultNodeShallowRetryCount attribute - CREAM : RunCommandError: \'Command glite-wms-job-logging-info --event RESUBMISSION https://emitestbed44.cnaf.infn.it:9000/2H2jolrHSaa8g313wHEM9w failed. Failure message: **** Warning: API_NATIVE_ERROR ****  \\nError while calling the "Eve::queryEvents" native api \\nUnable to retrieve any status information from: emitestbed44.cnaf.infn.it: glite.lb.Exception: edg_wll_QueryEvents: No such file or directory: no matching events found\\n\\tat glite::lb::ServerConnection::queryEvents[./src/ServerConnection.cpp:848]\\n\\n\\n**** Warning: API_NATIVE_ERROR ****  \\nError while calling the "Eve::queryEvents" native api \\nUnable to retrieve any matching information for jobid: https://emitestbed44.cnaf.infn.it:9000/2H2jolrHSaa8g313wHEM9w\\n\\n\'']
------------------------------------------------------------------------------
Check job cycle using jobs collection and jdl with DefaultNodeShal... ....
 Check job cycle using jobs collection and jdl with DefaultNodeShallowRetryCount attribute - CREAM 

Check job cycle using jobs collection and jdl with DefaultNodeShal... | FAIL |
[u"Check job cycle using jobs collection and jdl with DefaultNodeShallowRetryCount attribute - CREAM : TimeOutError: 'Timeout reached while waiting the job https://emitestbed44.cnaf.infn.it:9000/YtOrDqLuZsfV57OFMxEedA to finish'"]
------------------------------------------------------------------------------
Check job cycle using DAG job and jdl with AllowZippedISB attribute   ....
 Check job cycle using DAG job and jdl with AllowZippedISB attribute - CREAM 

Check job cycle using DAG job and jdl with AllowZippedISB attribute   | FAIL |
[u"Check job cycle using DAG job and jdl with AllowZippedISB attribute - CREAM : GeneralError: 'Message Archiving the ISB files not found'"]
------------------------------------------------------------------------------
Check job cycle using jobs collection and jdl with AllowZippedISB ... ....
 Check job cycle using jobs collection and jdl with AllowZippedISB attribute - CREAM 

Check job cycle using jobs collection and jdl with AllowZippedISB ... | FAIL |
[u"Check job cycle using jobs collection and jdl with AllowZippedISB attribute - CREAM : GeneralError: 'Message Archiving the ISB files not found'"]
------------------------------------------------------------------------------
Check job cycle using DAG job and jdl with UserTags attribute         ....
 Check job cycle using DAG job and jdl with UserTags attribute - CREAM 

Check job cycle using DAG job and jdl with UserTags attribute         | PASS |
------------------------------------------------------------------------------
Check job cycle using jobs collection and jdl with UserTags attribute ....
 Check job cycle using jobs collection and jdl with UserTags attribute - CREAM 

Check job cycle using jobs collection and jdl with UserTags attribute | PASS |
------------------------------------------------------------------------------
Check job cycle using DAG job and jdl with ExpiryTime attribute       ....
 Check job cycle using DAG job and jdl with ExpiryTime attribute - CREAM 

Check job cycle using DAG job and jdl with ExpiryTime attribute       | FAIL |
[u"Check job cycle using DAG job and jdl with ExpiryTime attribute - CREAM : TimeOutError: 'Timeout reached while waiting the job https://emitestbed44.cnaf.infn.it:9000/Oy575VwEaIQ2X6rbh7Tjnw to finish'"]
------------------------------------------------------------------------------
Check job cycle using jobs collection and jdl with ExpiryTime attr... ....
 Check job cycle using jobs collection and jdl with ExpiryTime attribute - CREAM 

Check job cycle using jobs collection and jdl with ExpiryTime attr... | FAIL |
[u"Check job cycle using jobs collection and jdl with ExpiryTime attribute - CREAM : TimeOutError: 'Timeout reached while waiting the job https://emitestbed44.cnaf.infn.it:9000/xOwY8rawpGDXPy2n2-hPow to finish'"]
------------------------------------------------------------------------------
WMS-jdl-attributes-coumpound-jobs-cycle :: WMS Jdl Attributes Coum... | FAIL |
11 critical tests, 2 passed, 9 failed
11 tests total, 2 passed, 9 failed
==============================================================================
Output:  /home/capannini/certificazione/WMSTaskIGIRTC166/output.xml
Log:     /home/capannini/certificazione/WMSTaskIGIRTC166/log.html
Report:  /home/capannini/certificazione/WMSTaskIGIRTC166/report.html

Job resubmission - PASSED

[capannini@emitestbed54 WMSTaskIGIRTC166]$ pybot ~/git/WMS-Test-Suite/robot_testsuites/wms_tests/testsuites/WMS-service/WMS-job-resubmit.html
==============================================================================
WMS-job-resubmit :: WMS Job Resubmit Test Suite                               
==============================================================================
Shallow Resubmission                                                  ....
 Shallow Resubmission - CREAM 

Shallow Resubmission                                                  | PASS |
------------------------------------------------------------------------------
Deep Resubmission                                                     ....
 Deep Resubmission - CREAM 

Deep Resubmission                                                     | PASS |
------------------------------------------------------------------------------
WMS-job-resubmit :: WMS Job Resubmit Test Suite                       | PASS |
2 critical tests, 2 passed, 0 failed
2 tests total, 2 passed, 0 failed
==============================================================================
Output:  /home/capannini/certificazione/WMSTaskIGIRTC166/output.xml
Log:     /home/capannini/certificazione/WMSTaskIGIRTC166/log.html
Report:  /home/capannini/certificazione/WMSTaskIGIRTC166/report.html

Limiter mechanism - FAILED

[capannini@emitestbed54 WMSTaskIGIRTC166]$ pybot ~/git/WMS-Test-Suite/robot_testsuites/wms_tests/testsuites/WMS-service/WMS-limiter-mechanism.html
==============================================================================
WMS-limiter-mechanism :: Test the WMS limiter mechanism operation             
==============================================================================
Test Option load1                                                     | FAIL |
Method isn't jobSubmit as expected: '' does not contain 'jobSubmit'
------------------------------------------------------------------------------
Test Option load5                                                     | FAIL |
Method isn't jobSubmit as expected: '' does not contain 'jobSubmit'
------------------------------------------------------------------------------
Test Option load15                                                    | FAIL |
Method isn't jobSubmit as expected: '' does not contain 'jobSubmit'
------------------------------------------------------------------------------
Test Option memusage                                                  | FAIL |
Method isn't jobSubmit as expected: '' does not contain 'jobSubmit'
------------------------------------------------------------------------------
Test Option swapusage                                                 | FAIL |
Submission not failed as expected
------------------------------------------------------------------------------
Test Option ftpconn                                                   | FAIL |
Method isn't jobSubmit as expected: '' does not contain 'jobSubmit'
------------------------------------------------------------------------------
Test Option diskusage                                                 | FAIL |
Method isn't jobSubmit as expected: '' does not contain 'jobSubmit'
------------------------------------------------------------------------------
Test Option fdnum                                                     | FAIL |
Method isn't jobSubmit as expected: '' does not contain 'jobSubmit'
------------------------------------------------------------------------------
Test Option jdnum                                                     | FAIL |
Submission not failed as expected
------------------------------------------------------------------------------
Test Option jdsize                                                    | FAIL |
Submission not failed as expected
------------------------------------------------------------------------------
WMS-limiter-mechanism :: Test the WMS limiter mechanism operation     | FAIL |
10 critical tests, 0 passed, 10 failed
10 tests total, 0 passed, 10 failed
==============================================================================
Output:  /home/capannini/certificazione/WMSTaskIGIRTC166/output.xml
Log:     /home/capannini/certificazione/WMSTaskIGIRTC166/log.html
Report:  /home/capannini/certificazione/WMSTaskIGIRTC166/report.html

Job list-match - PASSED

[capannini@emitestbed54 WMSTaskIGIRTC166]$ pybot ~/git/WMS-Test-Suite/robot_testsuites/wms_tests/testsuites/WMS-service/WMS-list-match.html
==============================================================================
WMS-list-match :: WMS list match testing suite.                               
==============================================================================
Check Executables                                                     | PASS |
------------------------------------------------------------------------------
Simple Matching                                                       | PASS |
------------------------------------------------------------------------------
Delegation Matching                                                   | PASS |
------------------------------------------------------------------------------
Exclude CE from Match                                                 | PASS |
------------------------------------------------------------------------------
Failure Matching                                                      | PASS |
------------------------------------------------------------------------------
Matching (EnableWMSFeedback True)                                     | PASS |
------------------------------------------------------------------------------
WMS-list-match :: WMS list match testing suite.                       | PASS |
6 critical tests, 6 passed, 0 failed
6 tests total, 6 passed, 0 failed
==============================================================================
Output:  /home/capannini/certificazione/WMSTaskIGIRTC166/output.xml
Log:     /home/capannini/certificazione/WMSTaskIGIRTC166/log.html
Report:  /home/capannini/certificazione/WMSTaskIGIRTC166/report.html

Prologue - epilogue - PASSED

[capannini@emitestbed54 WMSTaskIGIRTC166]$ pybot ~/git/WMS-Test-Suite/robot_testsuites/wms_tests/testsuites/WMS-service/WMS-prologue-epilogue.html
==============================================================================
WMS-prologue-epilogue :: WMS Prologue Epilogue Test Suite                     
==============================================================================
Prologue                                                              ....
 Prologue - CREAM 

Prologue                                                              | PASS |
------------------------------------------------------------------------------
Epilogue                                                              ....
 Epilogue - CREAM 

Epilogue                                                              | PASS |
------------------------------------------------------------------------------
Prologue and Epilogue                                                 ....
 Prologue and Epilogue - CREAM 

Prologue and Epilogue                                                 | PASS |
------------------------------------------------------------------------------
WMS-prologue-epilogue :: WMS Prologue Epilogue Test Suite             | PASS |
3 critical tests, 3 passed, 0 failed
3 tests total, 3 passed, 0 failed
==============================================================================
Output:  /home/capannini/certificazione/WMSTaskIGIRTC166/output.xml
Log:     /home/capannini/certificazione/WMSTaskIGIRTC166/log.html
Report:  /home/capannini/certificazione/WMSTaskIGIRTC166/report.html

Proxy renewal - PASSED

MYPROXYSERVER set to myproxy.cnaf.infn.it

[capannini@emitestbed54 WMSTaskIGIRTC166]$ myproxy-init -s myproxy.cnaf.infn.it -d -n
Your identity: /C=IT/O=INFN/OU=Personal Certificate/L=CNAF/CN=Fabio Capannini
Enter GRID pass phrase for this identity:
Creating proxy ............ Done
Proxy Verify OK
Your proxy is valid until: Wed Nov 13 15:34:12 2013
A proxy valid for 168 hours (7.0 days) for user /C=IT/O=INFN/OU=Personal Certificate/L=CNAF/CN=Fabio Capannini now exists on myproxy.cnaf.infn.it.

[root@emitestbed44 ~]# rm -rf /var/ice/persist_dir/*
[root@emitestbed44 ~]# rm -f /var/glite/spool/glite-renewd/*
[root@emitestbed44 ~]# /etc/init.d/glite-wms-ice restart

[capannini@emitestbed54 WMSTaskIGIRTC166]$ pybot ~/git/WMS-Test-Suite/robot_testsuites/wms_tests/testsuites/WMS-service/WMS-proxy-renewal.html
==============================================================================
WMS-proxy-renewal :: WMS Proxy Renewal Test Suite                             
==============================================================================
Proxy renewal                                                         ....
 Proxy renewal - CREAM 

Proxy renewal                                                         | PASS |
------------------------------------------------------------------------------
Proxy renewal without setting MYPROXYSERVER                           ....
 Proxy renewal without setting MYPROXYSERVER - CREAM 

Proxy renewal without setting MYPROXYSERVER                           | PASS |
------------------------------------------------------------------------------
WMS-proxy-renewal :: WMS Proxy Renewal Test Suite                     | PASS |
2 critical tests, 2 passed, 0 failed
2 tests total, 2 passed, 0 failed
==============================================================================
Output:  /home/capannini/certificazione/WMSTaskIGIRTC166/output.xml
Log:     /home/capannini/certificazione/WMSTaskIGIRTC166/log.html
Report:  /home/capannini/certificazione/WMSTaskIGIRTC166/report.html

Job purge - SOME FAILURES

[capannini@emitestbed54 WMSTaskIGIRTC166]$ pybot -e case1 ~/git/WMS-Test-Suite/robot_testsuites/wms_tests/testsuites/WMS-service/WMS-check-purger.html 
==============================================================================
WMS-check-purger :: WMS Check Purger Test Suite                               
==============================================================================
Test purge , normal job cycle ( Submit to CREAM CE )                  | PASS |
------------------------------------------------------------------------------
Test proxy cache purging                                              | PASS |
------------------------------------------------------------------------------
SandBoxDir cron purger ( Submit a job and force its purge before i... | PASS |
------------------------------------------------------------------------------
SandBoxDir cron purger ( Purge a DONE job )                           | PASS |
------------------------------------------------------------------------------
SandBoxDir cron purger ( Purge only jobs older than 12 hours )        | FAIL |
GeneralError: 'Removed 86 jobs while expected 104'
------------------------------------------------------------------------------
SandBoxDir cron purger ( Purge a job which proxy is already expired ) | FAIL |
GeneralError: 'Error while executing remote command => openssl x509 -in /var/SandboxDir/kR/https_3a_2f_2femitestbed44.cnaf.infn.it_3a9000_2fkR4N6lIwvqjrdAO83ccJJQ/user.proxy -noout -enddate'
------------------------------------------------------------------------------
SandBoxDir cron purger ( Purge a DAG job )                            | PASS |
------------------------------------------------------------------------------
WMS-check-purger :: WMS Check Purger Test Suite                       | FAIL |
7 critical tests, 5 passed, 2 failed
7 tests total, 5 passed, 2 failed
==============================================================================
Output:  /home/capannini/certificazione/WMSTaskIGIRTC166/output.xml
Log:     /home/capannini/certificazione/WMSTaskIGIRTC166/log.html
Report:  /home/capannini/certificazione/WMSTaskIGIRTC166/report.html

Configuration - SOME FAILURES

[capannini@emitestbed54 WMSTaskIGIRTC166]$ pybot ~/git/WMS-Test-Suite/robot_testsuites/wms_tests/testsuites/WMS-service/WMS-check-configuration-3.4.html 
==============================================================================
WMS-check-configuration-3.4 :: Check the syntax of the WMS configuration fi...
==============================================================================
Check Common Section                                                  | PASS |
------------------------------------------------------------------------------
Check JobController Section                                           | PASS |
------------------------------------------------------------------------------
Check NetworkServer Section                                           | PASS |
------------------------------------------------------------------------------
Check LogMonitor Section                                              | PASS |
------------------------------------------------------------------------------
Check WorkloadManager Section                                         | FAIL |
GeneralError: u'Section: WorkloadManager , problem with following attributes: set([\'IsmThreads  =  true;\', \'IsmIiLDAPCEFilterExt  =  "(|(GlueCEAccessControlBaseRule=VO:testers.eu-emi.eu)(GlueCEAccessControlBaseRule=VOMS:/testers.eu-emi.eu/*)(GlueCEAccessControlBaseRule=VO:testers2.eu-emi.eu)(GlueCEAccessControlBaseRule=VOMS:/testers2.eu-emi.eu/*)(GlueCEAccessControlBaseRule=VO:testers3.eu-emi.eu)(GlueCEAccessControlBaseRule=VOMS:/testers3.eu-emi.eu/*)(GlueCEAccessControlBaseRule=VO:dteam)(GlueCEAccessControlBaseRule=VOMS:/dteam/*)(GlueCEAccessControlBaseRule=VO:infngrid)(GlueCEAccessControlBaseRule=VOMS:/infngrid/*))";\', \'IsmThreads  =  false;\', \'IsmIiLDAPCEFilterExt  =  "(|(GlueCEAccessControlBaseRule=VO:testers.eu-emi.eu)(GlueCEAccessControlBaseRule=VOMS:/testers.eu-emi.eu/*)(GlueCEAccessControlBaseRule=VO:testers2.eu-emi.eu)(GlueCEAccessControlBaseRule=VOMS:/testers2.eu-emi.eu/*)(GlueCEAccessControlBaseRule=VO:cms)(GlueCEAccessControlBaseRule=VOMS:/cms/*)(GlueCEAccessControlBaseRule=VO:dteam)(GlueCEAccessControlBaseRule=VOMS:/dteam/*)(GlueCEAccessControlBaseRule=VO:infngrid)(GlueCEAccessControlBaseRule=VOMS:/infngrid/*))";\'])'
------------------------------------------------------------------------------
Check WorkloadManagerProxy Section                                    | FAIL |
GeneralError: u'Section: WorkloadManagerProxy , problem with following attributes: set([\'AsyncJobStart  =  true;\', \'AsyncJobStart  =  false;\', \'Wms_Pepc_ResourceId  =  "https://emitestbed44.cnaf.infn.it:7443/glite_wms_wmproxy_server";\'])'
------------------------------------------------------------------------------
Check ICE Section                                                     | FAIL |
GeneralError: u"Section: ICE , problem with following attributes: set(['proxy_renewal_timeout  =  120;', 'ice_log_level   =   500;', 'ice_log_level   =   300;'])"
------------------------------------------------------------------------------
Check Variables                                                       | FAIL |
This test requires the YAIM_FILE configuration file. Please set the YAIM_FILE variable in the test's configuration file.
------------------------------------------------------------------------------
WMS-check-configuration-3.4 :: Check the syntax of the WMS configu... | FAIL |
8 critical tests, 4 passed, 4 failed
8 tests total, 4 passed, 4 failed
==============================================================================
Output:  /home/capannini/certificazione/WMSTaskIGIRTC166/output.xml
Log:     /home/capannini/certificazione/WMSTaskIGIRTC166/log.html
Report:  /home/capannini/certificazione/WMSTaskIGIRTC166/report.html

Delegation - SOME FAILURES

[capannini@emitestbed54 WMSTaskIGIRTC166]$ pybot ~/git/WMS-Test-Suite/robot_testsuites/wms_tests/testsuites/WMS-service/WMS-delegation.html
==============================================================================
WMS-delegation :: WMS Delegation Test Suite                                   
==============================================================================
Check --autm-delegation option                                        | PASS |
------------------------------------------------------------------------------
Check --delegationid option                                           | PASS |
------------------------------------------------------------------------------
Try to delegate with a short proxy                                    | PASS |
------------------------------------------------------------------------------
Works with expired proxy                                              | FAIL |
RunCommandError: u'Command glite-wms-job-info --config /home/capannini/certificazione/WMSTaskIGIRTC166/WMSService-WMS-delegation_20131107121135/wms.conf -d deleg-1383822700 failed. Failure message: \nConnecting to the service https://emitestbed44.cnaf.infn.it:7443/glite_wms_wmproxy_server\n\n\nError - WMProxy Server Error\nProxy exception: the proxy has expired\nError code: SOAP-ENV:Server\n\n'
------------------------------------------------------------------------------
Works with long chain proxies (ggus ticket 79096)                     | PASS |
------------------------------------------------------------------------------
WMS-delegation :: WMS Delegation Test Suite                           | FAIL |
5 critical tests, 4 passed, 1 failed
5 tests total, 4 passed, 1 failed
==============================================================================
Output:  /home/capannini/certificazione/WMSTaskIGIRTC166/output.xml
Log:     /home/capannini/certificazione/WMSTaskIGIRTC166/log.html
Report:  /home/capannini/certificazione/WMSTaskIGIRTC166/report.html

Topic attachments
I Attachment Action Size Date Who Comment
Unknown file formatlog WMSService-WMS-jdl-attributes-job-cycle_20131105104334.log manage 115.7 K 2013-11-05 - 10:58 FabioCapannini  
Unknown file formatlog WMSService-WMS-job-cycle_20131104153313.log manage 149.7 K 2013-11-04 - 16:08 FabioCapannini  
Compressed Zip archivetgz log.conf.tgz manage 116.6 K 2013-11-06 - 17:18 FabioCapannini  
Compressed Zip archivetgz log.deleg.tgz manage 127.1 K 2013-11-07 - 11:24 FabioCapannini  
HTMLhtml log.html manage 218.0 K 2013-11-04 - 16:08 FabioCapannini  
Compressed Zip archivetgz log.jdl-compound.tgz manage 187.2 K 2013-11-05 - 15:41 FabioCapannini  
HTMLhtml log.jdl.html manage 234.7 K 2013-11-05 - 10:58 FabioCapannini  
Compressed Zip archivetgz log.jdl.tgz manage 146.9 K 2013-11-05 - 13:39 FabioCapannini  
Compressed Zip archivetgz log.limiter.tgz manage 130.7 K 2013-11-05 - 16:14 FabioCapannini  
Compressed Zip archivetgz log.list.tgz manage 115.8 K 2013-11-06 - 10:47 FabioCapannini  
Compressed Zip archivetgz log.prolog.tgz manage 118.1 K 2013-11-06 - 11:28 FabioCapannini  
Compressed Zip archivetgz log.proxy.tgz manage 133.5 K 2013-11-06 - 16:17 FabioCapannini  
Compressed Zip archivetgz log.purge.tgz manage 352.6 K 2013-11-06 - 16:42 FabioCapannini  
Compressed Zip archivetgz log.resub.tgz manage 120.3 K 2013-11-05 - 16:09 FabioCapannini  
Compressed Zip archivetgz log.tgz manage 137.6 K 2013-11-05 - 13:39 FabioCapannini  
XMLxml output.jdl.xml manage 205.9 K 2013-11-05 - 10:58 FabioCapannini  
XMLxml output.xml manage 153.2 K 2013-11-04 - 16:08 FabioCapannini  
HTMLhtml report.html manage 180.5 K 2013-11-04 - 16:07 FabioCapannini  
HTMLhtml report.jdl.html manage 182.5 K 2013-11-05 - 10:58 FabioCapannini  
Texttxt wms_3_6_1_install_sl5.txt manage 195.0 K 2013-10-28 - 14:26 CristinaAiftimiei install & update packages (SL5)
Texttxt wms_3_6_1_install_sl6.txt manage 348.0 K 2013-10-28 - 14:23 CristinaAiftimiei install & update packages (SL6)
Texttxt wms_3_6_1_update_sl5.txt manage 208.2 K 2013-10-28 - 14:26 CristinaAiftimiei install & update packages (SL5)
Texttxt wms_3_6_1_update_sl6.txt manage 355.6 K 2013-10-28 - 14:23 CristinaAiftimiei install & update packages (SL6)
Edit | Attach | PDF | History: r12 | r10 < r9 < r8 < r7 | Backlinks | Raw View | More topic actions...
Topic revision: r8 - 2013-11-07 - FabioCapannini
 
  • Edit
  • Attach
This site is powered by the TWiki collaboration platformCopyright © 2008-2019 by the contributing authors. All material on this collaboration platform is the property of the contributing authors.
Ideas, requests, problems regarding TWiki? Send feedback