Tags:
, view all tags

WMS 3.6.2 test report - IGIRTC-168

Deployment tests

Testing SL5

Testing SL6

Functionality tests

Job submission - SOME FAILURES

[capannini@emitestbed54 WMSTaskIGIRTC168]$ pybot ~/git/WMS-Test-Suite/robot_testsuites/wms_tests/testsuites/WMS-service/WMS-job-cycle.html 
==============================================================================
WMS-job-cycle :: WMS Job Cycle Test Suite                                     
==============================================================================
Submit Normal Job                                                     ......
 Submit Normal Job - CREAM 

Submit Normal Job                                                     | PASS |
------------------------------------------------------------------------------
Submit Bulk of Jobs                                                   ......
 Submit Bulk of Jobs - CREAM 

Submit Bulk of Jobs                                                   | PASS |
------------------------------------------------------------------------------
Submit Parametric Job                                                 ......
 Submit Parametric Job - CREAM 

Submit Parametric Job                                                 | PASS |
------------------------------------------------------------------------------
Submit DAG Job                                                        | PASS |
------------------------------------------------------------------------------
Submit MPI Job                                                        ......
 Submit MPI Job - CREAM 

Submit MPI Job                                                        | PASS |
------------------------------------------------------------------------------
Submit Perusal Job                                                    ....
 Submit Perusal Job - CREAM 

Submit Perusal Job                                                    | FAIL |
[u"Submit Perusal Job - CREAM : GeneralError: 'No chunks have been retrieved.'"]
------------------------------------------------------------------------------
Submit Bulk of Jobs , using a single jdl with all jdls of nodes       ......
 Submit Bulk of Jobs , using a single jdl with all jdls of nodes - CREAM 

Submit Bulk of Jobs , using a single jdl with all jdls of nodes       | PASS |
------------------------------------------------------------------------------
Testing forwarding parameters for parallel jobs                       ....
 Case1 


 Case 2 


 Case 3 


 Case 4 


 Case 5 

Testing forwarding parameters for parallel jobs                       | PASS |
------------------------------------------------------------------------------
WMS-job-cycle :: WMS Job Cycle Test Suite                             | FAIL |
8 critical tests, 7 passed, 1 failed
8 tests total, 7 passed, 1 failed
==============================================================================
Output:  /home/capannini/certificazione/WMSTaskIGIRTC168/output.xml
Log:     /home/capannini/certificazione/WMSTaskIGIRTC168/log.html
Report:  /home/capannini/certificazione/WMSTaskIGIRTC168/report.html

Jdl attributes - SOME FAILURES


[capannini@emitestbed54 WMSTaskIGIRTC168]$ pybot ~/git/WMS-Test-Suite/robot_testsuites/wms_tests/testsuites/WMS-service/WMS-jdl-attributes-job-cycle.html 
==============================================================================
WMS-jdl-attributes-job-cycle :: WMS Job Cycle Test Suite                      
==============================================================================
Jdl with AllowZippedISB                                               ....
 Jdl with AllowZippedISB - CREAM 

Jdl with AllowZippedISB                                               | FAIL |
Message 'Archiving the ISB files' not found: '-----------------------------------------
28 Nov 2013, 13:51:12 -I- PID: 27661 (Debug) - Vo read from proxy certificate extension
-----------------------------------------
-----------------------------------------
28 Nov 2013, 13:51:12 -I- PID: 27661 (Debug) - VirtualOrganisation value : testers.eu-emi.eu
-----------------------------------------
-----------------------------------------
28 Nov 2013, 13:51:12 -I- PID: 27661 (Debug) - Loaded user configuration file:
 /home/capannini/certificazione/WMSTaskIGIRTC168/WMSService-WMS-jdl-attributes-job-cycle_20131128135111/wms.conf
-----------------------------------------
-----------------------------------------
28 Nov 2013, 13:51:12 -I- PID: 27661 (Debug) - Configuration file: //etc/glite-wms/testers.eu-emi.eu/glite_wmsui.conf - VirtualOrganisation, MyProxyServer attribute(s) no more supported outside JDL Default Attributes section "JdlDefaultAttributes"
-----------------------------------------
    [ Message content over the limit has been removed. ]
...013, 13:51:13 -I- PID: 27661 (Debug) - Calling the WMProxy jobStart service
-----------------------------------------
-----------------------------------------
28 Nov 2013, 13:51:14 -I- PID: 27661 (Debug) - jobStart -  The job has been successfully started
-----------------------------------------

====================== glite-wms-job-submit Success ======================

The job has been successfully submitted to the WMProxy
Your job identifier is:

https://emitestbed44.cnaf.infn.it:9000/8F_lqv8zVxbUJkQ76tBWCw

==========================================================================

      *** Log file created ***
Possible Errors and Debug messages have been printed in the following file:
/tmp/glite-wms-job-submit_501_27661_20131128_13-51-12.log
' does not contain 'Archiving the ISB files'
------------------------------------------------------------------------------
Jdl with ExpiryTime                                                   | PASS |
------------------------------------------------------------------------------
Jdl with ShortDeadlineJob                                             ......
 Jdl with ShortDeadlineJob - CREAM 

Jdl with ShortDeadlineJob                                             | FAIL |
[u'CREAM : No Computing Element matching your job requirements has been found']
------------------------------------------------------------------------------
Jdl with DataRequirements                                             | FAIL |
RunCommandError: u'Command lfc-mkdir /grid/testers.eu-emi.eu/20131128135111 failed. Failure message: send2nsd: NS009 - fatal configuration error: Host unknown: emi2rc-sl5-lfc.cern.ch\ncannot create /grid/testers.eu-emi.eu/20131128135111: Host not known'
------------------------------------------------------------------------------
Jdl with InputSandboxBaseURI                                          ....    
 Jdl with InputSandboxBaseURI - CREAM 

Jdl with InputSandboxBaseURI                                          | PASS |
------------------------------------------------------------------------------
Jdl with OutputSandboxBaseDestURI                                     ...     
 Jdl with OutputSandboxBaseDestURI - CREAM 

Jdl with OutputSandboxBaseDestURI                                     | PASS |
------------------------------------------------------------------------------
Jdl with OutputSandboxDestURI                                         ...     
 Jdl with OutputSandboxDestURI - CREAM 

Jdl with OutputSandboxDestURI                                         | PASS |
------------------------------------------------------------------------------
Jdl with FuzzyRank attribute                                          ......
 Jdl with FuzzyRank attribute - CREAM 

Jdl with FuzzyRank attribute                                          | PASS |
------------------------------------------------------------------------------
Jdl with UserTags attribute                                           ......
 Jdl with UserTags attribute - CREAM 

Jdl with UserTags attribute                                           | PASS |
------------------------------------------------------------------------------
Jdl with LBAddresses attribute                                        .......
 Jdl with LBAddresses attribute - CREAM 

Jdl with LBAddresses attribute                                        | PASS |
------------------------------------------------------------------------------
Jdl with Environment attribute                                        ......
 Jdl with Environment attribute - CREAM 

Jdl with Environment attribute                                        | PASS |
------------------------------------------------------------------------------
Jdl with PerusalFileEnable attribute                                  ......
 Jdl with PerusalFileEnable attribute - CREAM 

Jdl with PerusalFileEnable attribute                                  | PASS |
------------------------------------------------------------------------------
Jdl with PerusalTimeInterval attribute                                ......
 Jdl with PerusalTimeInterval attribute - CREAM 

Jdl with PerusalTimeInterval attribute                                | FAIL |
[u"Jdl with PerusalTimeInterval attribute - CREAM : GeneralError: 'Time difference between chunks is shorter than the PerusalTimeInterval value (1300 secs)'"]
------------------------------------------------------------------------------
WMS-jdl-attributes-job-cycle :: WMS Job Cycle Test Suite              | FAIL |
13 critical tests, 9 passed, 4 failed
13 tests total, 9 passed, 4 failed
==============================================================================
Output:  /home/capannini/certificazione/WMSTaskIGIRTC168/output.xml
Log:     /home/capannini/certificazione/WMSTaskIGIRTC168/log.html
Report:  /home/capannini/certificazione/WMSTaskIGIRTC168/report.html

Jdl compound job - SOME FAILURES


[capannini@emitestbed54 WMSTaskIGIRTC168]$ pybot ~/git/WMS-Test-Suite/robot_testsuites/wms_tests/testsuites/WMS-service/WMS-jdl-attributes-coumpound-jobs-cycle.html 
==============================================================================
WMS-jdl-attributes-coumpound-jobs-cycle :: WMS Jdl Attributes Coumpound Job...
==============================================================================
Check job cycle using DAG job with jdl that contains other DAG        ....
 Check job cycle using DAG job with jdl that contains other DAG - CREAM 

Check job cycle using DAG job with jdl that contains other DAG        | FAIL |
[u"Check job cycle using DAG job with jdl that contains other DAG - CREAM : GeneralError: 'This test is not yet implemented'"]
------------------------------------------------------------------------------
Check job cycle using DAG job and jdl with DefaultNodeRetryCount a... ....
 Check job cycle using DAG job and jdl with DefaultNodeRetryCount attribute - CREAM 

Check job cycle using DAG job and jdl with DefaultNodeRetryCount a... | FAIL |
[u'Check job cycle using DAG job and jdl with DefaultNodeRetryCount attribute - CREAM : GeneralError: "Coumpound job https://emitestbed44.cnaf.infn.it:9000/pUWrbC9teJTC6j-ytDvNLw hasn\'t be correctly resubmitted"']
------------------------------------------------------------------------------
Check job cycle using jobs collection and jdl with DefaultNodeRetr... ....
 Check job cycle using jobs collection and jdl with DefaultNodeRetryCount attribute - CREAM 

Check job cycle using jobs collection and jdl with DefaultNodeRetr... | FAIL |
[u"Check job cycle using jobs collection and jdl with DefaultNodeRetryCount attribute - CREAM : TimeOutError: 'Timeout reached while waiting the job https://emitestbed44.cnaf.infn.it:9000/WJVfqpPUYWnNV4hqtT-xlg to finish'"]
------------------------------------------------------------------------------
Check job cycle using DAG job and jdl with DefaultNodeShallowRetry... ....
 Check job cycle using DAG job and jdl with DefaultNodeShallowRetryCount attribute - CREAM 

Check job cycle using DAG job and jdl with DefaultNodeShallowRetry... | FAIL |
[u'Check job cycle using DAG job and jdl with DefaultNodeShallowRetryCount attribute - CREAM : RunCommandError: \'Command glite-wms-job-logging-info --event RESUBMISSION https://emitestbed44.cnaf.infn.it:9000/JIRXCjxxQ5dHYpwv9uJ0SQ failed. Failure message: **** Warning: API_NATIVE_ERROR ****  \\nError while calling the "Eve::queryEvents" native api \\nUnable to retrieve any status information from: emitestbed44.cnaf.infn.it: glite.lb.Exception: edg_wll_QueryEvents: No such file or directory: no matching events found\\n\\tat glite::lb::ServerConnection::queryEvents[./src/ServerConnection.cpp:848]\\n\\n\\n**** Warning: API_NATIVE_ERROR ****  \\nError while calling the "Eve::queryEvents" native api \\nUnable to retrieve any matching information for jobid: https://emitestbed44.cnaf.infn.it:9000/JIRXCjxxQ5dHYpwv9uJ0SQ\\n\\n\'']
------------------------------------------------------------------------------
Check job cycle using jobs collection and jdl with DefaultNodeShal... ....
 Check job cycle using jobs collection and jdl with DefaultNodeShallowRetryCount attribute - CREAM 

Check job cycle using jobs collection and jdl with DefaultNodeShal... | FAIL |
[u"Check job cycle using jobs collection and jdl with DefaultNodeShallowRetryCount attribute - CREAM : TimeOutError: 'Timeout reached while waiting the job https://emitestbed44.cnaf.infn.it:9000/R038EKK7llSOcmIdqa07qw to finish'"]
------------------------------------------------------------------------------
Check job cycle using DAG job and jdl with AllowZippedISB attribute   ....
 Check job cycle using DAG job and jdl with AllowZippedISB attribute - CREAM 

Check job cycle using DAG job and jdl with AllowZippedISB attribute   | FAIL |
[u"Check job cycle using DAG job and jdl with AllowZippedISB attribute - CREAM : GeneralError: 'Message Archiving the ISB files not found'"]
------------------------------------------------------------------------------
Check job cycle using jobs collection and jdl with AllowZippedISB ... ....
 Check job cycle using jobs collection and jdl with AllowZippedISB attribute - CREAM 

Check job cycle using jobs collection and jdl with AllowZippedISB ... | FAIL |
[u"Check job cycle using jobs collection and jdl with AllowZippedISB attribute - CREAM : GeneralError: 'Message Archiving the ISB files not found'"]
------------------------------------------------------------------------------
Check job cycle using DAG job and jdl with UserTags attribute         ....
 Check job cycle using DAG job and jdl with UserTags attribute - CREAM 

Check job cycle using DAG job and jdl with UserTags attribute         | PASS |
------------------------------------------------------------------------------
Check job cycle using jobs collection and jdl with UserTags attribute ....
 Check job cycle using jobs collection and jdl with UserTags attribute - CREAM 

Check job cycle using jobs collection and jdl with UserTags attribute | PASS |
------------------------------------------------------------------------------
Check job cycle using DAG job and jdl with ExpiryTime attribute       ....
 Check job cycle using DAG job and jdl with ExpiryTime attribute - CREAM 

Check job cycle using DAG job and jdl with ExpiryTime attribute       | FAIL |
[u"Check job cycle using DAG job and jdl with ExpiryTime attribute - CREAM : TimeOutError: 'Timeout reached while waiting the job https://emitestbed44.cnaf.infn.it:9000/voAk735lcfkG8c2uWoG3gA to finish'"]
------------------------------------------------------------------------------
Check job cycle using jobs collection and jdl with ExpiryTime attr... ....
 Check job cycle using jobs collection and jdl with ExpiryTime attribute - CREAM 

Check job cycle using jobs collection and jdl with ExpiryTime attr... | FAIL |
[u"Check job cycle using jobs collection and jdl with ExpiryTime attribute - CREAM : TimeOutError: 'Timeout reached while waiting the job https://emitestbed44.cnaf.infn.it:9000/6xQIeDJHX20QKJBzWb1tYg to finish'"]
------------------------------------------------------------------------------
WMS-jdl-attributes-coumpound-jobs-cycle :: WMS Jdl Attributes Coum... | FAIL |
11 critical tests, 2 passed, 9 failed
11 tests total, 2 passed, 9 failed
==============================================================================
Output:  /home/capannini/certificazione/WMSTaskIGIRTC168/output.xml
Log:     /home/capannini/certificazione/WMSTaskIGIRTC168/log.html
Report:  /home/capannini/certificazione/WMSTaskIGIRTC168/report.html

Resubmission - PASSED


[capannini@emitestbed54 WMSTaskIGIRTC168]$ pybot ~/git/WMS-Test-Suite/robot_testsuites/wms_tests/testsuites/WMS-service/WMS-job-resubmit.html 
==============================================================================
WMS-job-resubmit :: WMS Job Resubmit Test Suite                               
==============================================================================
Shallow Resubmission                                                  ....
 Shallow Resubmission - CREAM 

Shallow Resubmission                                                  | PASS |
------------------------------------------------------------------------------
Deep Resubmission                                                     ....
 Deep Resubmission - CREAM 

Deep Resubmission                                                     | PASS |
------------------------------------------------------------------------------
WMS-job-resubmit :: WMS Job Resubmit Test Suite                       | PASS |
2 critical tests, 2 passed, 0 failed
2 tests total, 2 passed, 0 failed
==============================================================================
Output:  /home/capannini/certificazione/WMSTaskIGIRTC168/output.xml
Log:     /home/capannini/certificazione/WMSTaskIGIRTC168/log.html
Report:  /home/capannini/certificazione/WMSTaskIGIRTC168/report.html

Limiter mechanism - FAILED


[capannini@emitestbed54 WMSTaskIGIRTC168]$ pybot ~/git/WMS-Test-Suite/robot_testsuites/wms_tests/testsuites/WMS-service/WMS-limiter-mechanism.html 
==============================================================================
WMS-limiter-mechanism :: Test the WMS limiter mechanism operation             
==============================================================================
Test Option load1                                                     | FAIL |
Method isn't jobSubmit as expected: '' does not contain 'jobSubmit'
------------------------------------------------------------------------------
Test Option load5                                                     | FAIL |
Submission not failed as expected
------------------------------------------------------------------------------
Test Option load15                                                    | FAIL |
Method isn't jobSubmit as expected: '' does not contain 'jobSubmit'
------------------------------------------------------------------------------
Test Option memusage                                                  | FAIL |
Method isn't jobSubmit as expected: '' does not contain 'jobSubmit'
------------------------------------------------------------------------------
Test Option swapusage                                                 | FAIL |
Method isn't jobSubmit as expected: '' does not contain 'jobSubmit'
------------------------------------------------------------------------------
Test Option ftpconn                                                   | FAIL |
Method isn't jobSubmit as expected: '' does not contain 'jobSubmit'
------------------------------------------------------------------------------
Test Option diskusage                                                 | FAIL |
Method isn't jobSubmit as expected: '' does not contain 'jobSubmit'
------------------------------------------------------------------------------
Test Option fdnum                                                     | FAIL |
Method isn't jobSubmit as expected: '' does not contain 'jobSubmit'
------------------------------------------------------------------------------
Test Option jdnum                                                     | FAIL |
Submission not failed as expected
------------------------------------------------------------------------------
Test Option jdsize                                                    | FAIL |
Submission not failed as expected
------------------------------------------------------------------------------
WMS-limiter-mechanism :: Test the WMS limiter mechanism operation     | FAIL |
10 critical tests, 0 passed, 10 failed
10 tests total, 0 passed, 10 failed
==============================================================================
Output:  /home/capannini/certificazione/WMSTaskIGIRTC168/output.xml
Log:     /home/capannini/certificazione/WMSTaskIGIRTC168/log.html
Report:  /home/capannini/certificazione/WMSTaskIGIRTC168/report.html

List Match - PASSED


[capannini@emitestbed54 WMSTaskIGIRTC168]$ pybot ~/git/WMS-Test-Suite/robot_testsuites/wms_tests/testsuites/WMS-service/WMS-list-match.html 
==============================================================================
WMS-list-match :: WMS list match testing suite.                               
==============================================================================
Check Executables                                                     | PASS |
------------------------------------------------------------------------------
Simple Matching                                                       | PASS |
------------------------------------------------------------------------------
Delegation Matching                                                   | PASS |
------------------------------------------------------------------------------
Exclude CE from Match                                                 | PASS |
------------------------------------------------------------------------------
Failure Matching                                                      | PASS |
------------------------------------------------------------------------------
Matching (EnableWMSFeedback True)                                     | PASS |
------------------------------------------------------------------------------
WMS-list-match :: WMS list match testing suite.                       | PASS |
6 critical tests, 6 passed, 0 failed
6 tests total, 6 passed, 0 failed
==============================================================================
Output:  /home/capannini/certificazione/WMSTaskIGIRTC168/output.xml
Log:     /home/capannini/certificazione/WMSTaskIGIRTC168/log.html
Report:  /home/capannini/certificazione/WMSTaskIGIRTC168/report.html

Prologue/epilogue - PASSED


[capannini@emitestbed54 WMSTaskIGIRTC168]$ pybot ~/git/WMS-Test-Suite/robot_testsuites/wms_tests/testsuites/WMS-service/WMS-prologue-epilogue.html 
==============================================================================
WMS-prologue-epilogue :: WMS Prologue Epilogue Test Suite                     
==============================================================================
Prologue                                                              ....
 Prologue - CREAM 

Prologue                                                              | PASS |
------------------------------------------------------------------------------
Epilogue                                                              ....
 Epilogue - CREAM 

Epilogue                                                              | PASS |
------------------------------------------------------------------------------
Prologue and Epilogue                                                 ....
 Prologue and Epilogue - CREAM 

Prologue and Epilogue                                                 | PASS |
------------------------------------------------------------------------------
WMS-prologue-epilogue :: WMS Prologue Epilogue Test Suite             | PASS |
3 critical tests, 3 passed, 0 failed
3 tests total, 3 passed, 0 failed
==============================================================================
Output:  /home/capannini/certificazione/WMSTaskIGIRTC168/output.xml
Log:     /home/capannini/certificazione/WMSTaskIGIRTC168/log.html
Report:  /home/capannini/certificazione/WMSTaskIGIRTC168/report.html

Topic attachments
I Attachment Action Size Date Who Comment
Compressed Zip archivetgz jdl.compound.tgz manage 234.1 K 2013-11-29 - 09:24 FabioCapannini  
Compressed Zip archivetgz jdl.tgz manage 175.1 K 2013-11-28 - 14:21 FabioCapannini  
Compressed Zip archivetgz jobcycle.log.tgz manage 178.5 K 2013-11-27 - 16:27 FabioCapannini  
Compressed Zip archivetgz limiter.tgz manage 135.6 K 2013-11-29 - 14:29 FabioCapannini  
Compressed Zip archivetgz list.tgz manage 118.7 K 2013-11-29 - 14:35 FabioCapannini  
Compressed Zip archivetgz prologue-epilogue.tgz manage 126.8 K 2013-11-29 - 14:51 FabioCapannini  
Compressed Zip archivetgz resub.tgz manage 124.5 K 2013-11-29 - 14:25 FabioCapannini  
Texttxt wms_3_6_2_install_sl5.txt manage 207.9 K 2013-11-25 - 11:46 CristinaAiftimiei Install&Update WMS 3.6.2
Texttxt wms_3_6_2_install_sl6.txt manage 359.2 K 2013-11-25 - 11:46 CristinaAiftimiei Install&Update WMS 3.6.2
Texttxt wms_3_6_2_update_sl5.txt manage 219.4 K 2013-11-25 - 11:46 CristinaAiftimiei Install&Update WMS 3.6.2
Texttxt wms_3_6_2_update_sl6.txt manage 363.8 K 2013-11-25 - 11:46 CristinaAiftimiei Install&Update WMS 3.6.2
Edit | Attach | PDF | History: r12 | r9 < r8 < r7 < r6 | Backlinks | Raw View | More topic actions...
Topic revision: r7 - 2013-11-29 - FabioCapannini
 
  • Edit
  • Attach
This site is powered by the TWiki collaboration platformCopyright © 2008-2019 by the contributing authors. All material on this collaboration platform is the property of the contributing authors.
Ideas, requests, problems regarding TWiki? Send feedback